program: Gaussian 09
title: 000268018
version: EM64L-G09RevD.01
frameworkgroup: C1[X(C4H10O6S2)]
method: RPBEPBE
basis: SDD
operation: Freq
keyword: #p
keyword: freq=noraman
keyword: PBEPBE/SDD
title: #p freq=noraman PBEPBE/SDD
converged: YES YES NO NO
title: Mulliken charges:
elementType: S S O O O O O O C C C C H H H H H H H H H H
charge: 1.045201 1.053228 -0.414495 -0.571146 -0.509523 -0.508996 -0.513107 -0.503436 -0.337368 -0.583261 -0.248726 -0.726171 0.254045 0.258132 0.291412 0.293799 0.235701 0.228395 0.292039 0.294231 0.285563 0.384482
chargesum: 0.00000
title: Mulliken charges with hydrogens summed into heavy atoms:
elementType: S S O O O O O O C C C C
charge: 1.045201 1.053228 -0.414495 -0.186664 -0.509523 -0.508996 -0.513107 -0.503436 0.174809 0.001950 0.215370 0.145663
polarizability: 1.62288335e+02 3.21200466e+00 1.03455300e+02 9.03683187e-03 2.16523818e-02 1.02205230e+02
1716.lowfreq: -10.0683 -4.2332 -0.0012 0.0009 0.0023 3.6109 12.1709 13.7341 23.8477
frequency: 9.3065 13.4775 23.6899 51.0995 77.8749 95.3326 104.1936 148.2647 151.2018 181.0698 195.3868 216.3500 238.7814 255.6936 287.3575 299.9570 303.0551 336.6676 360.4754 384.2105 418.3809 545.5363 564.4116 595.2713 617.6572 787.4172 839.2614 845.4534 859.3116 914.2474 941.8364 953.4727 997.7389 1027.6290 1040.9078 1056.4418 1064.4440 1080.8432 1160.5449 1251.0507 1256.2618 1289.0480 1316.9048 1329.1353 1371.9357 1415.1023 1417.5276 1419.0026 1478.5993 1491.0077 2977.3571 3022.2670 3041.3070 3041.7204 3059.3534 3090.0323 3150.3506 3190.8007 3199.0847 3501.5754
redmass: 10.6882 7.0179 4.7215 5.5338 2.0677 3.5565 6.2422 1.3068 2.4786 1.8418 5.0450 4.8183 2.0350 4.9594 7.1023 5.7059 5.3757 11.0295 7.4041 8.0292 6.4582 13.8872 8.3421 8.6115 6.5278 1.1081 11.2897 11.4246 1.3094 2.7765 6.0892 4.1822 1.4572 1.6605 2.0045 3.1151 2.1315 1.5180 1.2014 1.2101 1.2316 1.0833 1.1325 1.2687 1.3056 1.0515 1.0505 1.1044 1.0736 1.0878 1.0545 1.0588 1.1089 1.0248 1.0560 1.1062 1.1107 1.1079 1.1078 1.0665
irintensity: 1.9654 0.5722 8.9644 7.5325 0.3728 0.0472 0.7326 0.9810 3.6042 34.9953 5.3150 1.9076 45.7176 46.7720 6.9783 58.1842 13.5039 11.6594 29.2681 0.8953 38.1458 237.6207 30.6210 60.8140 11.9754 3.9604 60.9050 52.0935 6.7515 27.4722 110.8042 83.6705 27.1027 57.8674 76.7291 3.8438 16.0313 16.7048 5.7586 8.6276 1.7076 0.7659 3.4019 12.0906 24.5033 13.7824 12.6934 5.9612 3.9557 21.5414 31.8242 4.4112 13.2719 0.3772 4.8222 8.1313 0.3836 0.0935 0.0700 57.4219
temp: 298.150 k
press: 1.00000 atm
elementType: 16 16 8 8 8 8 8 8 6 6 6 6 1 1 1 1 1 1 1 1 1 1
symmnumber: 1
zpe: 396883.1 jmol-1
zpe.correction: 0.151165 hartree
zpe.thermalcorrener: 0.167797 hartree
zpe.thermalcorrenthalpy: 0.168741 hartree
zpe.thermalcorrgfe: 0.102198 hartree
zpe.sumelectzpe: -1404.542984 hartree
zpe.sumelectthermal: -1404.526352 hartree
zpe.sumelectthermalent: -1404.525408 hartree
zpe.sumelectthermalfe: -1404.591951 hartree
dipole: 1.6324 0.8845 -0.4228
dipole: 1.9042
quadrupole: -84.5782 -89.6789 -98.3811
quadrupole: 27.1811 -0.8262 -0.8976
quadrupole: 6.3012 1.2005 -7.5017 27.1811 -0.8262 -0.8976
hfenergy: -1404.6941493 hartree
pointgroup: C01 [X(C4H10O6S2)]
dipole: 0.6417362 -0.3644414 0.1288861 debye
dipolederiv: 1.6383197 -0.1448289 -0.0331863 -0.0668173 1.4314198 0.0303358 -0.0339925 0.031275 1.3386812 1.9903053 -0.0263135 -0.0212583 0.2398213 1.2918768 -0.0151965 0.0377021 -0.0049552 1.3166211 -1.3554126 0.0977648 -0.0011376 0.081863 -0.492938 0.0006012 -0.0138198 -0.0137834 -0.4321175 -0.8273593 0.3991121 0.113657 0.4125295 -0.7192503 -0.057034 0.1213587 -0.0513068 -0.5994448 -0.6299601 -0.0146431 0.0024413 -0.0875395 -0.5571741 0.070997 0.0067336 0.13108 -0.5828196 -0.6309538 -0.0390884 -0.0366017 -0.0948034 -0.496274 -0.0145161 -0.0628468 -0.0895051 -0.6379505 -0.6142012 0.0189605 -0.0148342 -0.0453048 -0.5372682 -0.0295723 -0.1434242 -0.0889688 -0.6109476 -0.6370163 0.0025694 0.0460358 -0.0614768 -0.5363967 0.0357539 0.1621826 0.0882691 -0.6019373 -0.2470218 -0.0005332 0.0131382 0.0326322 -0.0233777 0.0150967 0.0122473 0.0109461 0.095415 0.2212903 0.0092028 -0.0217696 -0.1790922 -0.0218337 0.0052199 -0.0273532 0.0047585 -0.0205737 0.6378074 -0.1083265 -0.0022759 -0.4834761 0.3336259 -0.0342104 -0.050668 -0.0104184 0.3279439 -0.1380388 -0.0120547 0.0094069 -0.0031065 -0.1347948 0.003201 -0.0051938 0.0008232 -0.1065304 0.1116914 -0.0092362 -0.0257128 0.0161825 0.0446512 -0.0596675 -0.0117722 -0.0721404 -0.0156065 0.1240567 -0.0085727 0.0157189 0.0265447 0.0275313 0.0608535 -0.0042509 0.0703767 0.0088493 -0.0084837 -0.0267932 0.0110387 -0.0031733 0.0313334 0.0483287 -0.0436179 0.0535744 0.0321177 0.0004822 -0.0276443 -0.0130138 -0.0136351 0.0510647 -0.0425384 0.0443778 -0.0470307 0.0182641 0.0158125 -0.0020755 -0.0248765 0.0948591 0.0002052 -0.0549398 0.0213725 -0.0957859 -0.0516279 -0.0172238 0.0154967 0.011522 0.0983462 -0.0380856 0.0721209 -0.0098742 0.110304 -0.0402051 0.0890342 0.0182137 0.0404341 0.0175526 0.037453 0.0366864 0.0574128 0.016613 0.0377829 0.0989353 0.0163959 -0.0364335 0.0133238 0.0391053 -0.0332415 -0.0540735 -0.0142288 0.0366344 -0.0057192 -0.0113614 -0.0041726 0.0344746 0.0555677 0.0010359 -0.0047144 0.0020668 0.1268853 0.1836557 -0.1462443 -0.0281199 -0.0297046 0.2135587 -0.0393144 0.0022142 -0.0319633 0.3605659 unknown
polarizability: 162.1081867|-4.043119|103.5544049|-2.1447067|0.2156922|102.2862729 unknown
InChI: InChI=1S/C4H10O6S2/c1-11(5,6)10-3-2-4-12(7,8)9/h7H,2-4H2,1H3
charge 0 multiplicity 1
22 atoms
S  -3.417561 -0.133615 0.134697
S  3.523304 0.121443 -0.059782
O  1.758127 -0.522676 -0.181341
O  -4.370487 1.407285 0.567171
O  -3.445487 -1.177492 1.368962
O  -3.834224 -0.636499 -1.345527
O  3.694233 0.88792 1.356429
O  3.929376 0.869091 -1.435036
C  -0.599965 -0.199538 -0.033764
C  -1.742899 0.809634 0.100775
C  0.748727 0.547959 -0.049033
C  4.270857 -1.617705 0.004362
H  -0.699613 -0.779136 -0.969077
H  -0.610644 -0.907299 0.8142
H  -1.86324 1.491381 -0.755483
H  -1.75257 1.360038 1.05466
H  0.908072 1.106396 0.89456
H  0.812519 1.241344 -0.910092
H  3.870678 -2.085499 0.912584
H  3.937106 -2.121212 -0.911958
H  5.35983 -1.47735 0.039735
H  -5.345542 1.186529 0.550158
