program: Gaussian 09
title: 000268013
version: EM64L-G09RevD.01
frameworkgroup: C1[X(C17H12O3S)]
method: RPBEPBE
basis: SDD
operation: Freq
keyword: #p
keyword: freq=noraman
keyword: PBEPBE/SDD
title: #p freq=noraman PBEPBE/SDD
converged: YES YES NO NO
title: Mulliken charges:
elementType: S O O O C C C C C C C C C C C C C C C C C H H H H H H H H H H H H
charge: 0.146846 -0.384979 -0.163295 -0.137449 0.335765 0.206970 0.298917 0.090377 -0.849416 -0.165018 -0.197863 -0.372828 -0.371582 -0.220356 -0.229019 -0.135292 -0.264785 -0.165317 -0.207144 -0.237453 -0.231558 0.303950 0.327264 0.289861 0.291325 0.240889 0.243110 0.355587 0.247802 0.250419 0.234124 0.234684 0.235463
chargesum: 0.00000
title: Mulliken charges with hydrogens summed into heavy atoms:
elementType: S O O O C C C C C C C C C C C C C C C C C
charge: 0.146846 -0.029392 -0.163295 -0.137449 0.335765 0.206970 0.298917 0.090377 -0.218202 -0.165018 -0.197863 -0.082967 -0.080257 0.020533 0.014092 -0.135292 -0.016984 0.085102 0.026981 -0.002768 0.003905
polarizability: 3.39638082e+02 -9.31295737e+00 2.31721215e+02 1.23576743e+01 -7.77799820e+00 1.04403382e+02
1716.lowfreq: -7.8656 -2.1833 0.0011 0.0013 0.0016 3.5703 18.5823 22.4314 37.9714
frequency: 18.5388 22.3504 37.9638 53.3462 82.9773 98.2325 125.9997 157.3083 183.8460 198.9980 224.6425 265.6963 295.1374 322.3292 360.4516 364.1914 393.5575 400.0092 403.9476 409.7088 439.5529 452.5836 472.2721 495.6506 543.8654 609.6887 617.1944 637.0709 654.5872 672.9713 678.0420 692.5053 707.2526 725.8501 736.4347 749.5937 792.1478 828.9889 839.8118 870.8416 908.3386 920.5724 932.2425 946.8617 970.0492 984.7693 992.6119 994.2904 994.6943 1012.2972 1017.3098 1039.1269 1071.5688 1080.0057 1082.9203 1134.5540 1174.1327 1174.9212 1182.1849 1189.9874 1224.9903 1244.9096 1256.7904 1281.7200 1309.5194 1317.1445 1375.1080 1395.9617 1407.2072 1428.2188 1437.7549 1446.2556 1463.5837 1484.9723 1534.8395 1569.3836 1577.7646 1587.6096 1590.7267 1600.3052 1616.2101 3018.9708 3105.3149 3113.4679 3131.0516 3137.5954 3140.1205 3149.3686 3153.7446 3158.5104 3167.5999 3171.3767 3181.6096
redmass: 4.6485 5.3737 6.4889 9.9097 6.5816 6.4090 5.0220 7.1455 6.5816 6.0230 3.7261 5.6928 4.1783 6.4066 12.4485 7.0580 6.4784 5.0328 5.1886 4.3329 5.2181 5.5366 3.9371 6.5664 5.3902 6.4385 6.5458 5.8873 6.2333 6.7528 4.8069 2.2955 3.5963 1.4333 2.8086 1.5167 1.4652 3.1433 1.2782 3.1915 1.3756 2.2938 2.2634 3.1296 1.3920 6.1799 1.4168 1.3192 4.5840 1.3690 3.4026 2.0228 2.4357 1.6374 2.5753 1.7195 1.0771 1.0750 1.6168 1.1332 2.6284 1.8643 1.2881 1.7144 1.4313 2.8576 8.3569 9.6888 2.0211 2.1323 2.1657 1.2366 2.0095 2.9155 11.6902 8.2519 7.6365 6.2004 5.9566 7.3831 8.1070 1.0593 1.0694 1.1021 1.0850 1.0881 1.0865 1.0927 1.0912 1.0963 1.0969 1.1017 1.0973
irintensity: 0.7412 0.4786 0.1775 0.5584 1.8838 5.2047 0.4391 2.8254 1.0382 3.2319 1.4267 4.2637 0.8718 1.4910 3.7534 2.3447 0.0256 2.6078 2.1179 0.4887 8.6538 6.7447 14.4876 12.0257 6.4516 0.7236 2.1314 18.6773 2.4433 25.8348 15.5179 29.6066 5.8804 53.6209 2.3946 111.0174 61.3335 1.2402 0.2124 2.4736 1.6444 12.5897 4.2885 2.8753 0.1435 6.0558 5.2055 0.0430 22.8896 0.0420 28.3963 0.9795 22.7618 12.1298 6.7176 16.0957 1.8524 1.7341 52.1544 1.2802 43.7620 61.4942 28.3568 23.9208 18.5766 66.4593 0.2660 16.8045 127.2121 12.5043 4.2234 17.9537 45.2203 29.6875 283.7697 31.0578 120.4794 5.8828 40.9781 28.7045 1.4800 11.1960 782.9631 97.4175 0.3718 1.4626 3.0461 12.6227 4.8045 24.2277 15.9766 16.5573 8.4408
temp: 298.150 k
press: 1.00000 atm
elementType: 16 8 8 8 6 6 6 6 6 6 6 6 6 6 6 6 6 6 6 6 6 1 1 1 1 1 1 1 1 1 1 1 1
symmnumber: 1
zpe: 635332.4 jmol-1
zpe.correction: 0.241985 hartree
zpe.thermalcorrener: 0.259652 hartree
zpe.thermalcorrenthalpy: 0.260597 hartree
zpe.thermalcorrgfe: 0.193776 hartree
zpe.sumelectzpe: -1277.282277 hartree
zpe.sumelectthermal: -1277.264610 hartree
zpe.sumelectthermalent: -1277.263665 hartree
zpe.sumelectthermalfe: -1277.330486 hartree
dipole: -2.1037 -5.8535 -1.5566
dipole: 6.4119
quadrupole: -99.9090 -138.3739 -131.3611
quadrupole: -16.2197 3.6262 -5.1824
quadrupole: 23.3057 -15.1592 -8.1464 -16.2197 3.6262 -5.1824
hfenergy: -1277.5242619 hartree
pointgroup: C01 [X(C17H12O3S1)]
dipole: 0.6445643 -2.3840885 0.5141725 debye
polarizability: 340.5014582|0.2039239|230.1685313|12.2985287|11.891916|105.0926888 unknown
InChI: InChI=1S/C17H12O3S/c18-15-12-8-4-5-9-13(12)16(19)17(20)14(15)10-21-11-6-2-1-3-7-11/h1-9,18H,10H2
charge 0 multiplicity 1
33 atoms
S  1.987483 -0.132911 -1.234529
O  -0.363525 -1.705929 0.039486
O  -0.66604 3.112603 -0.039624
O  -3.460827 2.896312 -0.10487
C  -2.527018 -0.672043 0.055324
C  -0.420529 0.722227 0.033014
C  -3.359255 0.486403 0.020614
C  -1.062605 -0.514977 0.040126
C  1.074469 0.858858 0.149933
C  -1.20624 1.962796 -0.023602
C  -2.757984 1.851026 -0.043214
C  -3.118795 -1.957552 0.102901
C  -4.766816 0.343098 0.035017
C  -4.524623 -2.088636 0.122171
C  -5.351531 -0.939692 0.088578
C  3.645716 -0.387565 -0.459176
C  4.343906 -1.577306 -0.775927
C  4.235844 0.588967 0.376611
C  5.639677 -1.786237 -0.252367
C  5.526152 0.362621 0.908124
C  6.232597 -0.821071 0.594758
H  1.458807 0.440109 1.096817
H  1.344975 1.920975 0.059502
H  -2.471095 -2.837709 0.12339
H  -5.378769 1.250445 0.001737
H  -4.975853 -3.085666 0.161759
H  -6.441043 -1.04672 0.101619
H  0.593984 -1.554046 -0.25988
H  3.881333 -2.33316 -1.419948
H  3.712673 1.522997 0.604987
H  6.178686 -2.706874 -0.501052
H  5.979757 1.119622 1.557048
H  7.234386 -0.989261 1.003975
