program: Gaussian 09
title: 000022806
version: EM64L-G09RevD.01
frameworkgroup: C1[X(C14H8O2S)]
method: RPBEPBE
basis: SDD
operation: Freq
keyword: #p
keyword: freq=noraman
keyword: PBEPBE/SDD
title: #p freq=noraman PBEPBE/SDD
converged: NO YES NO NO
title: Mulliken charges:
elementType: S O O C C C C C C C C C C C C C C H H H H H H H H
charge: -0.050589 -0.324486 -0.188282 0.381275 0.307283 0.292656 0.283928 -0.021424 -0.322737 -0.490632 -0.399574 -0.362603 -0.383130 -0.199069 -0.223171 -0.222782 -0.222585 0.298434 0.294104 0.296369 0.264088 0.245456 0.243200 0.243887 0.260383
chargesum: 0.00000
title: Mulliken charges with hydrogens summed into heavy atoms:
elementType: S O O C C C C C C C C C C C C C C
charge: -0.050589 -0.064103 -0.188282 0.381275 0.307283 0.292656 0.283928 -0.021424 -0.322737 -0.490632 -0.101139 -0.068499 -0.086761 0.065019 0.022285 0.020418 0.021303
polarizability: 3.29398058e+02 -6.00601415e+00 2.14667649e+02 -3.07845738e-02 1.00787498e-02 6.31793223e+01
1716.lowfreq: -7.5186 0.0013 0.0015 0.0021 2.0822 11.6274 55.1341 79.7527 133.5715
frequency: 55.1289 79.7437 133.5709 171.6677 187.4719 207.6899 245.6686 303.0618 329.6270 357.6978 392.2046 412.0889 416.3241 419.1023 462.9578 480.3605 482.0983 522.3397 601.3033 635.0370 647.2000 665.0237 707.5056 731.5734 749.1363 794.3012 803.5060 806.6935 859.7413 879.7648 908.3071 927.4124 949.2158 962.8118 996.9685 1007.5206 1015.5498 1034.2705 1062.3873 1086.3681 1107.2705 1160.8646 1171.7805 1179.2082 1193.0155 1251.3443 1283.6701 1303.9665 1342.2528 1364.6630 1400.9695 1409.7551 1432.2368 1433.3575 1476.6676 1498.9145 1523.5087 1541.8807 1578.7896 1595.2584 1612.6146 1931.3023 3141.2215 3142.6236 3156.6610 3160.2875 3169.1733 3171.8162 3180.3164
redmass: 6.7367 7.7290 5.4189 6.5390 4.6080 6.6930 5.6696 10.0010 8.6539 8.0850 8.1588 6.7340 4.0531 3.9519 8.2442 3.5926 10.2949 4.8333 6.5727 6.8045 4.2214 6.5982 3.0465 3.8724 7.1118 1.4578 7.6189 1.6126 2.1872 1.1338 5.8787 1.5951 6.9559 1.5441 1.3942 1.4029 1.3776 2.2034 2.0865 2.8743 3.5527 1.9513 1.2304 1.3009 1.8495 1.7358 2.0574 2.4443 3.3176 2.9824 6.3744 6.6170 2.1309 2.8209 2.5781 3.0944 7.1975 7.7842 6.1935 6.4254 7.0618 1.1269 1.0867 1.0871 1.0910 1.0921 1.0962 1.0994 1.0983
irintensity: 5.9700 0.2018 0.6050 0.0039 0.5475 0.9362 0.0539 4.6109 4.0832 0.4828 14.3703 2.3811 0.7720 0.2210 6.3224 2.5115 0.9849 7.9854 1.4797 4.0289 8.0096 0.9693 54.2027 2.2537 1.0041 10.2659 11.3718 74.8105 30.7020 46.0720 3.3829 1.3990 14.1321 2.8468 4.5979 1.4150 0.5590 7.3644 7.5009 1.3818 66.2283 0.2700 3.8981 16.4495 3.7615 2.7093 109.0675 108.3301 15.7012 49.0547 21.4334 35.1552 32.7555 92.5397 27.7229 219.4556 108.9404 91.3921 0.6108 11.5141 2.1807 131.8138 3.5301 6.1750 7.8058 0.5772 13.2333 13.9802 14.3149
temp: 298.150 k
press: 1.00000 atm
elementType: 16 8 8 6 6 6 6 6 6 6 6 6 6 6 6 6 6 1 1 1 1 1 1 1 1
symmnumber: 1
zpe: 462989.5 jmol-1
zpe.correction: 0.176343 hartree
zpe.thermalcorrener: 0.188784 hartree
zpe.thermalcorrenthalpy: 0.189728 hartree
zpe.thermalcorrgfe: 0.137342 hartree
zpe.sumelectzpe: -1085.680069 hartree
zpe.sumelectthermal: -1085.667629 hartree
zpe.sumelectthermalent: -1085.666684 hartree
zpe.sumelectthermalfe: -1085.719070 hartree
dipole: -2.2428 0.1201 -0.0049
dipole: 2.2461
quadrupole: -89.1495 -108.5312 -108.3856
quadrupole: 16.8863 0.0095 0.0128
quadrupole: 12.8726 -6.5091 -6.3635 16.8863 0.0095 0.0128
hfenergy: -1085.8564122 hartree
pointgroup: C01 [X(C14H8O2S1)]
dipole: -0.8642143 -0.1838738 -0.0138748 debye
dipolederiv: -0.3264373 0.0046588 -0.001209 -0.4595664 -0.6605728 -0.022474 -0.0191079 -0.0176942 -0.1977984 -0.5237475 0.0094703 -0.0013877 0.4182417 -0.7244994 -0.0095412 0.0125581 -0.0137743 -0.3063721 -0.5910068 -0.0715054 -0.0057111 -0.3428927 -1.0108951 -0.0311184 -0.0154847 -0.02663 -0.3085886 -1.1038541 -0.0185594 -0.0128992 0.5725289 -0.2642083 -0.0041907 0.0083177 -0.010922 0.0213315 -0.7440387 -0.1860362 -0.0153612 -0.3916112 0.08593 -0.0029505 -0.022418 -0.0006095 0.0523419 -0.2118692 -0.1189179 -0.0059915 -0.2247923 -0.0180199 -0.0026029 -0.0103944 -0.0022945 -0.0029205 -0.132285 0.3232395 0.010485 0.3105449 -0.2126553 -0.0067243 0.009696 -0.0065734 0.0452472 1.3493423 0.0887193 0.0150338 -0.6146014 0.689143 0.0114014 -0.0099241 0.0204441 0.141132 1.3213723 -0.0952429 0.008865 0.2094917 0.9802054 0.0363907 0.0200787 0.0318949 0.1001937 0.1752851 -0.1141572 -0.0010693 0.4923074 0.7889848 0.0396747 0.02148 0.03347 -0.1214435 -0.1639692 0.1581701 0.0052643 0.1134969 0.0788411 0.0084178 0.0036437 0.0087911 -0.104225 -0.2458882 0.1603342 0.004502 -0.05064 0.0582332 0.0057096 -0.00285 0.0076769 -0.1058723 -0.3809274 -0.1125873 -0.0070724 0.2043051 0.114552 0.010261 0.0053019 0.0070972 -0.1032664 0.260912 0.1782937 0.0103779 -0.0101213 -0.3476496 -0.0108842 0.0032695 -0.0089028 -0.0606489 0.3323343 -0.0562175 0.003046 -0.0603782 0.0651667 0.0067809 0.002945 0.0064864 -0.1310552 0.2294653 -0.1629938 -0.0024353 -0.0401971 -0.0023042 0.0047016 0.002308 0.0034949 -0.1363359 0.2369163 0.1065243 0.0074952 -0.1436834 -0.0761955 0.0006043 -0.0021959 0.0031825 -0.1354084 0.103528 -0.0590886 -0.0028653 -0.0030704 0.0166728 -0.0053844 -0.0008711 -0.0059013 0.1563827 0.1284305 -0.0434427 -0.0018942 -0.0016742 0.0107581 -0.0056213 -0.000857 -0.005955 0.1587814 0.1300445 0.0210513 0.000554 -0.0497533 0.0096329 -0.0060082 -0.0019819 -0.0053322 0.1568847 -0.0044012 -0.0063252 -0.0019868 -0.0931527 0.0710818 -0.0039934 -0.0051853 -0.0029576 0.1488544 -0.0390023 0.0886374 0.0012249 0.1132827 0.0187417 -0.0038511 0.0021142 -0.0040607 0.1536491 -0.0491375 0.0835518 0.0011157 0.1134559 0.0246304 -0.0038511 0.0022579 -0.0042136 0.1571672 -0.0966948 -0.056054 -0.0045048 -0.0702822 0.07318 -0.0038308 -0.0050298 -0.0036403 0.1575999 0.3456287 -0.1215227 -0.0035763 0.0087616 0.2312459 -0.0009152 0.0023294 -0.0030766 0.2643696 unknown
polarizability: 324.7297343|23.2660295|219.0698622|3.5956706|6.0930953|63.4454326 unknown
InChI: InChI=1S/C14H8O2S/c15-13-8-4-1-2-5-9(8)14(16)12-10(13)6-3-7-11(12)17/h1-7,16H
charge 0 multiplicity 1
25 atoms
S  3.02403 2.617565 0.165492
O  0.175118 2.594084 0.128923
O  -0.562907 -2.887926 -0.079796
C  1.22173 0.390413 0.061844
C  1.001399 -1.042536 0.005076
C  -1.295731 0.730031 0.048718
C  -1.522575 -0.678074 -0.006322
C  0.072599 1.256692 0.080995
C  -0.375196 -1.628044 -0.032137
C  2.586876 0.897571 0.096188
C  2.086648 -1.926514 -0.016428
C  -2.404457 1.618947 0.071269
C  -2.846466 -1.176656 -0.03754
C  3.661336 -0.057233 0.072088
C  3.420932 -1.432206 0.017219
C  -3.716859 1.111019 0.039844
C  -3.94048 -0.289085 -0.014591
H  1.874528 -2.999235 -0.059702
H  -2.214377 2.694618 0.113063
H  -2.986188 -2.2613 -0.079724
H  4.683851 0.332017 0.098386
H  4.262952 -2.131964 0.000192
H  -4.567693 1.799885 0.05735
H  -4.963394 -0.678895 -0.038744
H  1.224124 2.898325 0.154838
