program: Gaussian 09
title: 000268032
version: EM64L-G09RevD.01
frameworkgroup: C1[X(C19H17NO2)]
method: RPBEPBE
basis: SDD
operation: Freq
keyword: #p
keyword: freq=noraman
keyword: PBEPBE/SDD
title: #p freq=noraman PBEPBE/SDD
converged: YES YES NO NO
title: Mulliken charges:
elementType: O O N C C C C C C C C C C C C C C C C C C C H H H H H H H H H H H H H H H H H
charge: -0.490645 -0.343303 -0.347288 0.030069 -0.671893 0.389321 0.355624 0.375150 -0.392661 -0.391659 -0.390894 -0.393529 0.118788 -0.340787 -0.229794 -0.257046 -0.246518 -0.229276 -0.243098 -0.247333 -0.191341 -0.206486 0.261573 0.225212 0.289408 0.234562 0.255244 0.285207 0.379428 0.245289 0.221200 0.221780 0.219663 0.222972 0.223424 0.224205 0.343308 0.238238 0.253884
chargesum: 0.00000
title: Mulliken charges with hydrogens summed into heavy atoms:
elementType: O O N C C C C C C C C C C C C C C C C C C C
charge: -0.111217 -0.343303 -0.003980 0.030069 -0.185109 0.389321 0.355624 0.375150 -0.103253 -0.157097 -0.135650 -0.108322 0.118788 -0.095498 -0.008594 -0.035265 -0.026855 -0.006303 -0.019674 -0.023128 0.046897 0.047397
polarizability: 2.52827643e+02 2.28723209e+01 1.80533349e+02 -1.10795102e+01 -8.09425449e+00 1.96875786e+02
1716.lowfreq: -13.7065 -6.1486 0.0002 0.0008 0.0009 0.4477 6.0407 35.6142 36.6616
frequency: -6.1279 35.5762 36.6522 56.0563 74.7887 85.3726 130.2789 179.0076 188.1639 227.5652 243.8913 256.0897 261.0012 282.1951 339.9681 379.1819 403.4649 409.5648 414.2644 457.6417 472.0117 490.9268 531.4983 534.5112 550.1945 590.5495 602.6521 616.3143 617.4874 650.0361 693.7380 703.3118 710.5310 725.7194 742.3753 758.2867 761.2417 780.1603 791.0833 808.3933 855.6955 858.7427 862.0037 879.7875 907.5431 921.0222 929.5277 939.9171 955.5774 979.5626 981.9700 989.5893 990.0266 996.4571 1000.9739 1005.9945 1020.6927 1027.5257 1032.7174 1056.7721 1077.8092 1083.4203 1099.4493 1153.9509 1158.6686 1168.1682 1169.3887 1178.8518 1187.8721 1191.4944 1220.0356 1245.1047 1268.9171 1305.5780 1306.0952 1315.8062 1363.2986 1377.3991 1379.7811 1390.4709 1428.7899 1433.0475 1434.0164 1446.9426 1459.4383 1477.3249 1479.2359 1553.3684 1587.5849 1590.6543 1592.6605 1606.9795 1611.5582 1631.0075 2985.5593 3049.6855 3079.9725 3116.3361 3117.8743 3126.7924 3127.1068 3128.4406 3139.4958 3142.3310 3154.4146 3156.2845 3168.6945 3174.3353 3175.0586 3199.7767 3511.0359
redmass: 3.8492 5.0772 5.8037 4.9267 4.4813 4.5460 5.1294 5.0514 5.4537 5.2852 4.7133 4.6035 4.6945 4.7220 3.9253 4.6213 2.8637 2.9649 3.2576 4.0962 4.3213 4.7739 4.0620 3.4108 5.0767 5.6794 4.8739 6.4162 6.3994 5.2570 4.6953 1.9770 1.7377 2.8793 1.9648 1.4165 1.9169 2.2409 1.6211 1.2302 1.3328 2.1485 1.4096 3.1078 2.2371 1.5177 1.4703 1.8353 1.5261 1.3631 1.3657 5.3009 5.9125 1.6109 1.4030 2.3946 3.9046 2.1481 2.0558 2.3536 1.5749 2.0552 1.9954 1.9974 1.5360 1.0851 1.0791 1.3570 1.1429 1.7012 1.8556 1.5302 1.9092 1.5549 1.3717 1.3865 1.7404 8.0557 8.1494 2.3188 2.1247 2.2187 1.9789 1.2128 1.3751 2.2100 2.1156 6.5250 5.8535 6.0885 3.3757 6.1392 6.1086 6.2122 1.0617 1.0987 1.0706 1.0842 1.0842 1.0879 1.0909 1.0885 1.0934 1.0934 1.0975 1.0987 1.0970 1.0894 1.0951 1.1012 1.0777
irintensity: 0.0493 1.1499 0.1168 1.6376 1.5554 1.4244 1.5770 3.2979 1.6608 2.8703 2.2868 4.4443 2.2635 0.5710 2.4656 6.6055 0.1125 1.5358 6.1896 2.2717 11.8152 10.1886 4.9713 8.9437 28.2065 8.1196 13.1790 0.1249 0.2280 8.4089 4.4841 32.7354 71.0371 27.2850 36.6379 80.9317 35.2482 29.7669 1.9473 187.0279 0.2358 1.1496 6.2079 2.0787 8.7117 5.6705 6.4908 1.5676 2.8228 0.2665 0.8931 0.0760 0.3506 10.1143 1.1417 20.4503 30.3112 19.6991 0.6505 27.4971 2.5583 15.5238 4.5740 18.3490 11.4069 2.2287 0.4722 12.1623 2.0075 5.5447 13.0665 10.6681 17.3475 7.1774 2.5921 2.6647 0.6404 2.5185 4.5018 60.2761 14.8009 3.6525 27.8595 15.0761 169.7911 20.5452 21.1961 34.6807 14.6172 6.1374 159.4617 12.7604 3.1142 118.2949 13.2324 28.1128 751.1200 3.5305 0.2961 6.9584 20.9701 16.9613 45.5590 30.4859 25.2593 27.5473 12.3303 0.3480 10.1942 7.4720 60.2145
temp: 298.150 k
press: 1.00000 atm
elementType: 8 8 7 6 6 6 6 6 6 6 6 6 6 6 6 6 6 6 6 6 6 6 1 1 1 1 1 1 1 1 1 1 1 1 1 1 1 1 1
symmnumber: 1
zpe: 815322.1 jmol-1
zpe.correction: 0.310540 hartree
zpe.thermalcorrener: 0.327641 hartree
zpe.thermalcorrenthalpy: 0.328585 hartree
zpe.thermalcorrgfe: 0.265207 hartree
zpe.sumelectzpe: -937.892951 hartree
zpe.sumelectthermal: -937.875850 hartree
zpe.sumelectthermalent: -937.874905 hartree
zpe.sumelectthermalfe: -937.938284 hartree
dipole: 5.7913 -0.5071 -3.8832
dipole: 6.9911
quadrupole: -99.6727 -125.8370 -125.6602
quadrupole: -1.6870 -1.1572 1.7872
quadrupole: 17.3839 -8.7804 -8.6036 -1.6870 -1.1572 1.7872
hfenergy: -938.2034908 hartree
pointgroup: C01 [X(C19H17N1O2)]
dipole: 2.2138189 -0.0050669 1.6322576 debye
polarizability: 249.2765782|-26.6381904|184.1346134|11.5914056|-10.5930632|196.8255863 unknown
InChI: InChI=1S/C19H17NO2/c21-18-15(8-7-13-20-18)14-19(22,16-9-3-1-4-10-16)17-11-5-2-6-12-17/h1-13,20,22H,14H2
charge 0 multiplicity 1
39 atoms
O  -0.432062 0.707772 -1.940958
O  2.196056 0.955757 -1.928936
N  3.994419 0.736711 -0.491355
C  -0.591444 0.293138 -0.549425
C  0.283727 1.229628 0.384775
C  -2.074289 0.575893 -0.190886
C  -0.249376 -1.205219 -0.39029
C  1.779998 0.982722 0.492591
C  -2.788061 1.553088 -0.927751
C  0.160471 -1.775224 0.842308
C  -2.721254 -0.070343 0.892052
C  -0.391143 -2.056482 -1.515091
C  2.606113 0.896456 -0.711232
C  2.405623 0.897157 1.738766
C  -4.118966 1.88146 -0.585232
C  0.428333 -3.159222 0.947834
C  -4.051662 0.258684 1.236188
C  -0.127397 -3.439449 -1.412372
C  -4.756612 1.239387 0.501111
C  0.284992 -3.998558 -0.179853
C  3.821051 0.727918 1.887717
C  4.601117 0.64906 0.745637
H  0.101368 2.250363 -0.007557
H  -0.139199 1.204235 1.405608
H  -2.288681 2.021778 -1.779852
H  0.278824 -1.144104 1.73026
H  -2.20129 -0.853112 1.454744
H  -0.702149 -1.607737 -2.463346
H  0.563323 0.811449 -2.119155
H  1.787251 0.968308 2.641984
H  -4.659474 2.635068 -1.169964
H  0.746998 -3.579798 1.908878
H  -4.539808 -0.257349 2.071254
H  -0.242765 -4.08158 -2.293323
H  -5.790035 1.49169 0.765545
H  0.491827 -5.071972 -0.099991
H  4.548587 0.676937 -1.352163
H  4.284662 0.661712 2.87363
H  5.685924 0.519577 0.758345
