program: Gaussian 09
title: 000267983
version: EM64L-G09RevD.01
frameworkgroup: C1[X(C14H13NO2)]
method: RPBEPBE
basis: SDD
operation: Freq
keyword: #p
keyword: freq=noraman
keyword: PBEPBE/SDD
title: #p freq=noraman PBEPBE/SDD
converged: YES YES NO NO
title: Mulliken charges:
elementType: O O N C C C C C C C C C C C C C C H H H H H H H H H H H H H
charge: -0.342721 -0.261329 -0.375428 0.176257 0.347863 0.244057 -0.371393 -0.369817 -0.412598 -0.336280 -0.254519 -0.228028 -0.238584 -0.232414 -0.244187 0.274743 -0.605057 0.249714 0.243159 0.245296 0.280256 0.228441 0.230590 0.225189 0.225202 0.228458 0.339169 0.271562 0.230921 0.231477
chargesum: 0.00000
title: Mulliken charges with hydrogens summed into heavy atoms:
elementType: O O N C C C C C C C C C C C C C C
charge: -0.342721 -0.261329 -0.036259 0.176257 0.347863 0.244057 -0.121679 -0.126658 -0.167302 -0.056024 -0.026078 0.002562 -0.013394 -0.007211 -0.015729 0.274743 0.128902
polarizability: 1.96046890e+02 -1.34899118e+01 2.14435725e+02 -1.17063909e+01 -3.53741923e+00 8.87442255e+01
1716.lowfreq: -1.5565 -0.0010 0.0003 0.0004 2.9548 8.2804 19.3857 38.0767 49.3372
frequency: 19.3121 38.0687 49.3253 81.3823 85.8523 105.4246 138.7499 159.5213 211.1909 237.1798 253.3803 296.4945 323.1379 377.9314 404.1107 407.4160 473.9065 523.9847 557.4637 596.6846 602.7034 607.4513 618.3692 669.0991 684.5449 703.9281 718.6725 735.5263 762.3759 777.1129 796.3298 851.3510 863.9103 893.1103 920.1172 944.5340 974.1876 980.2972 988.3664 992.4702 995.4392 1035.1135 1047.4635 1076.7147 1082.2070 1113.9176 1126.6338 1146.5786 1170.0046 1172.3233 1179.0816 1192.9638 1212.2034 1261.6058 1290.5395 1317.5761 1369.3513 1373.5905 1423.8442 1431.7880 1441.8152 1457.6877 1469.5777 1483.9242 1498.2769 1514.6437 1576.8116 1590.3801 1606.0076 1612.4047 1694.5553 2981.3195 3059.2754 3114.1435 3122.0226 3129.1169 3131.5388 3142.6471 3144.7339 3155.5906 3163.7905 3167.3757 3195.8044 3570.7479
redmass: 6.0307 4.4449 4.3019 4.4436 4.2988 1.0932 4.1180 3.3219 4.7714 5.5106 5.6942 5.4594 4.6201 5.0628 3.8641 3.1859 3.6611 3.7449 3.4662 1.1613 5.6695 6.6395 6.3230 6.5851 10.9527 1.7925 4.3574 2.9857 1.4998 1.8996 5.2088 1.2515 1.4205 4.4018 1.4399 1.3895 1.4002 1.3579 5.2410 1.3162 6.8213 2.1001 2.3925 3.2369 1.7688 1.9439 1.2836 1.6959 1.7099 1.0517 1.3403 1.1274 2.5133 1.7316 2.1369 1.3697 5.6285 7.8547 2.3214 1.1619 2.3111 1.4528 1.9986 1.0437 2.6316 1.4067 5.8450 6.7140 6.7641 6.1490 9.4704 1.0354 1.1026 1.0983 1.0845 1.0877 1.0859 1.0929 1.0916 1.0962 1.0984 1.1003 1.0953 1.0773
irintensity: 3.1802 4.2367 0.4810 2.0252 1.3749 0.1815 2.6621 1.8096 0.2889 0.3970 1.6469 9.4167 5.6700 11.7516 0.7024 0.2464 6.1299 5.7534 2.0832 115.3725 11.2766 12.9560 0.3718 1.6606 31.3190 42.5132 8.2817 32.4020 87.5905 17.1964 5.3363 0.4702 4.9234 65.0376 1.7547 1.9483 0.3794 0.4239 0.5655 0.2471 10.7017 1.8330 3.7428 135.3389 49.2165 149.1643 0.0813 92.9929 291.5295 0.0737 180.6161 4.5674 2.5232 9.1535 0.1862 0.9872 2.6728 1.2760 51.5216 27.9654 16.0310 201.5377 43.0911 15.1558 30.0399 120.3081 1.0815 3.7960 3.5256 5.0350 262.7513 80.1292 34.1359 3.5812 3.4115 3.3788 1.8168 31.9742 8.4431 40.5559 30.3657 11.5873 2.2820 35.6965
temp: 298.150 k
press: 1.00000 atm
elementType: 8 8 7 6 6 6 6 6 6 6 6 6 6 6 6 6 6 1 1 1 1 1 1 1 1 1 1 1 1 1
symmnumber: 1
zpe: 618876.7 jmol-1
zpe.correction: 0.235718 hartree
zpe.thermalcorrener: 0.250915 hartree
zpe.thermalcorrenthalpy: 0.251860 hartree
zpe.thermalcorrgfe: 0.191160 hartree
zpe.sumelectzpe: -745.301717 hartree
zpe.sumelectthermal: -745.286520 hartree
zpe.sumelectthermalent: -745.285575 hartree
zpe.sumelectthermalfe: -745.346275 hartree
dipole: 0.5277 -2.3334 -1.4047
dipole: 2.7742
quadrupole: -92.6723 -80.3385 -102.5462
quadrupole: 8.1952 2.7574 -0.5789
quadrupole: -0.8200 11.5139 -10.6939 8.1952 2.7574 -0.5789
hfenergy: -745.537435 hartree
pointgroup: C01 [X(C14H13N1O2)]
dipole: -0.8344837 -0.4263787 0.5595833 debye
polarizability: 220.1510831|6.2136806|187.1892514|-9.7944854|19.1980902|91.8865061 unknown
InChI: InChI=1S/C14H13NO2/c1-15-14(16)17-13-10-6-5-9-12(13)11-7-3-2-4-8-11/h2-10,15H,1H3
charge 0 multiplicity 1
30 atoms
O  0.535758 -1.221849 0.256449
O  2.003801 -2.653529 -0.974215
N  0.095961 -3.425406 0.167327
C  0.418778 1.172503 0.027354
C  -1.07352 1.132231 0.078025
C  1.231055 0.001974 0.049054
C  1.090979 2.422931 -0.03994
C  -1.825793 0.231877 -0.725621
C  -1.780803 2.047277 0.905027
C  2.640186 0.065921 -0.012297
C  2.49734 2.508145 -0.103142
C  3.270976 1.325756 -0.095976
C  -3.236635 0.248245 -0.702276
C  -3.192674 2.060563 0.93333
C  -3.928516 1.160822 0.128666
C  0.98984 -2.473019 -0.25988
C  0.246011 -4.842411 -0.171086
H  0.488159 3.337059 -0.076692
H  -1.301392 -0.466958 -1.384588
H  -1.218652 2.733923 1.5486
H  3.226597 -0.854466 -0.006665
H  2.983664 3.487109 -0.1689
H  4.363554 1.377417 -0.152475
H  -3.797038 -0.445494 -1.339505
H  -3.716256 2.76836 1.585921
H  -5.024078 1.171084 0.147164
H  -0.686147 -3.104857 0.739588
H  1.145456 -4.950115 -0.797622
H  -0.626953 -5.212787 -0.739289
H  0.370943 -5.4605 0.737165
