program: Gaussian 09
title: 000268007
version: EM64L-G09RevD.01
frameworkgroup: C1[X(C22H22O3S)]
method: RPBEPBE
basis: SDD
operation: Freq
keyword: #p
keyword: freq=noraman
keyword: PBEPBE/SDD
title: #p freq=noraman PBEPBE/SDD
converged: YES YES NO NO
title: Mulliken charges:
elementType: S O O O C C C C C C C C C C C C C C C C C C C C C C H H H H H H H H H H H H H H H H H H H H H H
charge: 0.173644 -0.397747 -0.154208 -0.137995 -0.074873 -0.353406 -0.652129 -0.686927 -0.716902 0.241529 0.014880 -0.170411 0.338716 -0.217831 0.290971 -0.212208 -0.381255 -0.375762 -0.217836 -0.228874 -0.221907 -0.231926 -0.385042 -0.379845 0.448767 -0.803901 0.269574 0.224485 0.298381 0.214915 0.251708 0.220634 0.223311 0.223777 0.214066 0.245138 0.287649 0.291346 0.249712 0.251467 0.384331 0.239969 0.242390 0.233022 0.233279 0.236578 0.229464 0.227278
chargesum: 0.00000
title: Mulliken charges with hydrogens summed into heavy atoms:
elementType: S O O O C C C C C C C C C C C C C C C C C C C C C C
charge: 0.173644 -0.013416 -0.154208 -0.137995 -0.074873 0.140653 -0.138833 0.008725 -0.033920 0.241529 0.014880 -0.170411 0.338716 -0.217831 0.290971 -0.212208 -0.093606 -0.084415 0.031876 0.022593 0.018063 0.010464 -0.152020 -0.146565 0.448767 -0.110580
polarizability: 3.26102927e+02 5.21063913e+00 2.92028476e+02 6.12079377e+01 1.61714945e+01 2.08056575e+02
1716.lowfreq: -35.6541 -0.0005 0.0006 0.0008 6.1081 6.5182 8.8505 12.3966 17.4337
frequency: -35.5206 11.2055 17.3877 31.8886 32.5884 48.7736 54.7703 64.4650 94.1540 110.5102 129.7060 156.2386 162.3790 183.8473 215.6300 218.4558 242.3750 252.7015 256.0691 270.8496 295.8246 310.4405 338.4456 348.1239 357.3334 358.0570 368.5129 382.5751 390.4965 402.5683 410.1257 415.6277 422.7399 428.3998 454.9107 484.0866 492.4755 513.0063 563.1126 578.3067 611.6356 632.0048 632.3520 655.3186 673.0875 686.8632 715.5245 731.0696 760.5470 787.8036 788.8065 797.5256 824.3380 838.4336 851.5062 866.4916 919.9520 927.1192 933.6214 957.8903 958.7195 976.8781 978.6590 985.4960 988.4810 989.8834 1004.4610 1009.8631 1012.0139 1027.9656 1041.8788 1048.2748 1075.2308 1076.3264 1113.8538 1116.6739 1119.4483 1161.7726 1172.4856 1185.3637 1188.0432 1219.8467 1220.2862 1236.1651 1242.7125 1274.3753 1282.4162 1292.5586 1300.8522 1325.4939 1337.0854 1358.2610 1375.5928 1384.9205 1392.2823 1395.1541 1395.3175 1397.7784 1439.1630 1459.0482 1463.4590 1467.2281 1469.0081 1472.5856 1476.5732 1478.3447 1482.6820 1486.9256 1488.8354 1536.2991 1572.2630 1572.4856 1581.9195 1604.2757 1611.5638 1617.0466 2948.2986 2970.3743 2973.4206 2976.0470 2977.3643 3042.4369 3058.1425 3061.5426 3064.4277 3068.6919 3079.5065 3087.4076 3094.2417 3123.1300 3125.0778 3139.7119 3151.7383 3153.1032 3157.5807 3167.3783 3182.0076 3553.0860
redmass: 1.0263 5.1172 6.7547 4.6732 4.9572 4.8279 10.4901 3.7614 6.2778 2.6146 4.6828 3.6849 4.4281 5.7563 1.3435 2.9639 2.5577 3.1963 1.4971 2.5989 3.7654 2.7446 3.3989 6.1258 3.4253 3.8315 4.7542 5.2233 3.4519 5.7956 2.8893 4.5071 2.4307 3.4222 4.3032 2.8875 2.6490 2.8670 4.7647 3.9895 5.7196 5.7047 6.6493 5.1464 4.5726 4.9235 3.4198 3.8493 1.5181 1.6526 3.8124 3.0108 1.3809 2.8951 1.2457 3.0471 3.8322 2.1022 1.5256 1.3031 1.9401 1.3861 2.0537 1.4074 1.8273 1.8065 4.0982 1.3710 2.5889 2.1993 2.0041 1.5720 2.8557 2.9510 1.3193 1.7706 1.8241 2.2032 1.1357 1.4423 1.1149 2.7193 2.8245 2.6031 1.9375 1.4447 1.6332 1.2905 2.6278 1.4154 1.4560 4.7235 1.2380 2.5679 3.2917 1.2412 8.1731 1.2237 2.4357 1.0547 1.0724 1.0747 1.0925 1.0538 1.1194 2.2875 1.4931 1.0717 1.6650 8.9449 6.0843 8.9207 7.3830 6.2239 8.3205 7.9591 1.0684 1.0369 1.0592 1.0390 1.0400 1.0948 1.0947 1.0985 1.0961 1.0951 1.0985 1.0999 1.1005 1.0886 1.0886 1.0864 1.0954 1.0912 1.0964 1.0971 1.0971 1.0650
irintensity: 0.3585 1.1095 2.5419 0.8932 0.5363 0.2303 0.0255 0.2283 1.5083 0.8704 1.2526 1.3422 0.6400 0.1654 0.2586 0.8600 1.3741 1.3961 0.7733 1.4362 0.2378 0.7115 2.5743 11.5617 1.2939 0.6149 5.8258 2.1747 0.7022 4.2034 0.2599 1.5635 61.8760 4.6085 20.2010 38.6229 11.7537 23.5885 4.4036 3.3040 1.4305 6.0344 1.4392 6.7051 11.2229 17.3181 1.1538 5.5518 1.5746 45.3273 19.6645 2.7366 48.7627 0.4982 0.2312 2.8447 32.4278 5.8421 3.7892 1.8219 8.5479 0.0419 8.5688 0.1087 5.1420 7.3546 12.9587 0.1694 16.7410 6.6802 3.5376 24.8022 6.5648 12.2212 10.9034 13.6598 56.9203 65.2465 26.5090 69.0528 3.0287 22.5268 9.0174 30.2454 33.1880 25.2173 15.7845 0.7094 33.6167 50.5702 3.7655 0.0060 40.1360 26.5940 3.2664 29.7129 0.9889 13.0451 8.9721 1.2896 3.3851 4.6268 14.8784 12.3796 12.7081 31.0230 7.5754 22.8765 39.9874 249.9694 0.5502 16.9828 67.5023 6.0278 45.1887 7.2549 22.7603 31.6970 24.8318 37.5116 20.2247 5.2923 19.3136 15.6440 25.8007 20.9000 30.1374 16.2540 25.5513 10.0911 19.8830 3.3805 21.1431 5.2028 1.1726 18.1444 8.3934 49.0028
temp: 298.150 k
press: 1.00000 atm
elementType: 16 8 8 8 6 6 6 6 6 6 6 6 6 6 6 6 6 6 6 6 6 6 6 6 6 6 1 1 1 1 1 1 1 1 1 1 1 1 1 1 1 1 1 1 1 1 1 1
symmnumber: 1
zpe: 996240.2 jmol-1
zpe.correction: 0.379448 hartree
zpe.thermalcorrener: 0.404027 hartree
zpe.thermalcorrenthalpy: 0.404972 hartree
zpe.thermalcorrgfe: 0.322473 hartree
zpe.sumelectzpe: -1473.402706 hartree
zpe.sumelectthermal: -1473.378127 hartree
zpe.sumelectthermalent: -1473.377182 hartree
zpe.sumelectthermalfe: -1473.459681 hartree
dipole: -1.5389 -2.6924 -2.5476
dipole: 4.0134
quadrupole: -137.9569 -154.6671 -169.2296
quadrupole: 12.4754 20.2821 -14.8884
quadrupole: 15.9943 -0.7159 -15.2784 12.4754 20.2821 -14.8884
hfenergy: -1473.782154 hartree
pointgroup: C01 [X(C22H22O3S1)]
dipole: -0.6253201 -1.0220191 -1.0284188 debye
polarizability: 327.7130102|3.2187064|290.8411642|59.9316476|18.4516445|207.6338036 unknown
InChI: InChI=1S/C22H22O3S/c1-14-8-10-15(11-9-14)26-22(2,3)13-12-18-19(23)16-6-4-5-7-17(16)20(24)21(18)25/h4-11,23H,12-13H2,1-3H3
charge 0 multiplicity 1
48 atoms
S  3.388339 -2.048732 -1.11943
O  -2.309106 -2.362758 -0.744873
O  -0.733413 0.940508 2.405197
O  -2.959455 2.534317 1.788523
C  2.115441 -2.393227 0.334428
C  0.89126 -1.470812 0.113784
C  -0.231416 -1.617584 1.190766
C  2.807137 -2.147691 1.686689
C  1.774759 -3.886352 0.133179
C  -1.443316 -0.763309 0.870708
C  -2.399008 -1.154969 -0.054913
C  -1.582485 0.529533 1.554226
C  -3.587974 -0.364299 -0.410396
C  3.877746 -0.293695 -0.840631
C  -3.794092 0.90161 0.215986
C  -2.815471 1.418344 1.218058
C  -4.527168 -0.834952 -1.359663
C  -4.932301 1.674228 -0.114334
C  4.995817 0.013778 -0.027956
C  3.182885 0.756761 -1.488213
C  -5.660419 -0.055395 -1.680698
C  -5.866311 1.199901 -1.059507
C  5.400065 1.356088 0.145073
C  3.594184 2.096286 -1.309275
C  4.707507 2.419337 -0.490608
C  5.163149 3.858215 -0.323849
H  1.229645 -0.418131 0.123529
H  0.488163 -1.663522 -0.901231
H  0.160185 -1.276736 2.164241
H  -0.516684 -2.684161 1.317167
H  3.088007 -1.086877 1.805482
H  2.131872 -2.415712 2.522309
H  3.719093 -2.763624 1.774687
H  1.298496 -4.06275 -0.849743
H  1.08954 -4.237582 0.928027
H  2.686169 -4.507942 0.185097
H  -4.361749 -1.804421 -1.836105
H  -5.061668 2.641046 0.383133
H  5.546219 -0.79772 0.459463
H  2.329709 0.522158 -2.133527
H  -1.486439 -2.854898 -0.491487
H  -6.383032 -0.426484 -2.415219
H  -6.746556 1.800164 -1.31155
H  6.265102 1.579707 0.781213
H  3.042478 2.900241 -1.811446
H  5.889245 4.137781 -1.112097
H  4.315755 4.562469 -0.393836
H  5.659193 4.015862 0.649823
