program: Gaussian 09
title: 000267993
version: EM64L-G09RevD.01
frameworkgroup: C1[X(C13H16N4O2S2)]
method: RPBEPBE
basis: SDD
operation: Freq
keyword: #p
keyword: freq=noraman
keyword: PBEPBE/SDD
title: #p freq=noraman PBEPBE/SDD
converged: YES YES NO NO
title: Mulliken charges:
elementType: S S O O N N N N C C C C C C C C C C C C C H H H H H H H H H H H H H H H H
charge: 0.192624 0.000928 -0.208598 -0.212893 -0.132250 0.027298 -0.007292 0.020480 0.375404 0.184438 -0.659462 -0.363395 -0.375898 -0.430875 -0.428718 -0.331094 -0.473858 0.411760 -0.390548 -0.644664 -0.640222 0.301868 0.302420 0.259207 0.213924 0.252603 0.232081 0.313808 0.278446 0.254345 0.285651 0.203108 0.279414 0.222684 0.218307 0.243981 0.224988
chargesum: 0.00000
title: Mulliken charges with hydrogens summed into heavy atoms:
elementType: S S O O N N N N C C C C C C C C C C C C C
charge: 0.192624 0.000928 -0.208598 -0.212893 -0.132250 0.027298 -0.007292 0.020480 0.375404 0.184438 -0.055174 0.109736 0.108786 -0.117067 -0.150272 -0.076749 -0.473858 0.411760 -0.104897 0.060542 0.047055
polarizability: 2.49707098e+02 1.37587391e+01 2.60867883e+02 1.09600458e+01 4.09129906e+00 1.58564092e+02
1716.lowfreq: -8.0530 -5.7418 -0.0018 -0.0012 -0.0009 7.3903 21.6927 26.8784 44.6035
frequency: 21.4281 26.8264 44.5917 53.8574 68.7352 77.7769 86.8584 92.0194 111.9393 124.4591 142.0420 191.4723 209.9359 220.3665 232.3618 260.3340 279.0934 295.8428 309.2125 338.9810 340.8750 350.1684 390.2949 418.2187 430.0472 449.4524 472.3034 523.8262 536.2498 551.5478 571.8311 582.6120 612.7632 638.8221 651.5899 704.8884 730.0162 756.0829 761.7884 765.3171 783.8678 808.7132 816.0748 822.3231 858.3804 880.9465 903.5068 919.0278 937.2456 956.4564 984.5437 1007.2406 1028.5096 1058.1637 1066.1360 1075.7357 1093.7506 1120.5977 1146.1492 1147.1147 1189.8241 1195.7135 1210.3128 1247.9063 1263.8578 1272.5962 1290.0221 1292.2497 1298.5378 1335.6488 1339.1039 1348.7707 1368.0222 1389.4882 1390.5509 1392.5884 1427.3572 1430.5522 1433.5392 1463.0066 1468.7472 1469.9030 1472.3130 1478.6858 1482.0943 1487.5493 1501.3439 1582.4901 1621.7411 2954.4782 2989.4593 2990.1244 3006.3898 3012.0171 3065.4574 3071.3566 3088.2214 3088.7388 3101.5093 3107.8833 3141.1248 3146.5076 3157.7132 3191.2036 3227.1059
redmass: 5.9367 5.1326 4.3375 12.7257 4.8963 3.5435 8.4354 3.3437 6.8196 7.2413 3.4959 2.9602 1.3352 3.5132 1.4163 3.0402 4.8797 3.6320 3.8091 4.9285 7.5010 3.9632 6.7177 3.4766 3.0868 4.0252 4.2524 5.6073 3.4088 5.7324 5.1911 5.1521 6.7004 7.1882 7.3561 5.9163 8.2381 3.6119 2.3472 3.8428 1.1492 1.7018 4.9185 1.3100 1.6006 2.2753 2.7746 5.2916 1.4190 2.5895 1.3291 2.7993 2.1370 2.3853 2.3482 1.8668 1.8640 2.3446 1.8440 1.8304 2.5191 1.6023 8.2027 1.4199 1.3438 1.8740 1.3663 1.8722 1.2834 3.9160 1.2518 1.2795 10.5801 1.9382 1.7095 1.2064 2.7381 2.1505 1.1798 1.1030 1.0678 1.0558 4.6428 4.9215 1.0774 1.0578 1.3652 8.1530 7.8743 1.0718 1.0364 1.0356 1.0619 1.0604 1.1026 1.1003 1.1000 1.0998 1.1020 1.1013 1.0951 1.0952 1.0905 1.0952 1.0979
irintensity: 1.2407 1.9903 0.3823 0.6392 0.5891 0.8007 1.1210 0.9648 2.8095 2.7146 0.7186 2.8553 0.2917 0.6446 0.8746 2.2795 0.3452 0.8870 3.4136 0.3814 2.0492 15.4262 6.1715 10.8909 4.6818 2.2231 10.3144 0.9033 3.6755 8.3185 4.1744 2.5639 31.3128 58.6982 15.1358 22.8693 45.6281 3.8928 11.0138 20.7828 1.7137 27.0396 14.6400 0.2162 55.8558 31.0004 26.2981 14.5358 18.0366 21.5948 0.5844 15.5758 0.4828 49.9113 15.3354 18.3642 10.2463 4.3768 56.2516 13.8934 37.4908 18.6487 321.2041 12.0034 60.8101 65.6577 8.9059 13.7881 17.1350 17.0878 7.4667 19.2885 165.6909 54.4593 7.8199 27.9059 56.6065 99.9238 3.4097 22.3567 8.6458 10.5270 34.8191 26.9296 12.6260 21.5664 85.9672 1.1695 9.9670 55.0601 19.9920 24.1531 46.3323 22.8670 2.4159 5.6728 30.9706 28.2508 28.1910 16.3384 42.8802 16.5001 7.8005 3.0796 1.0379
temp: 298.150 k
press: 1.00000 atm
elementType: 16 16 8 8 7 7 7 7 6 6 6 6 6 6 6 6 6 6 6 6 6 1 1 1 1 1 1 1 1 1 1 1 1 1 1 1 1
symmnumber: 1
zpe: 737648.0 jmol-1
zpe.correction: 0.280955 hartree
zpe.thermalcorrener: 0.301813 hartree
zpe.thermalcorrenthalpy: 0.302758 hartree
zpe.thermalcorrgfe: 0.229184 hartree
zpe.sumelectzpe: -1668.920540 hartree
zpe.sumelectthermal: -1668.899682 hartree
zpe.sumelectthermalent: -1668.898737 hartree
zpe.sumelectthermalfe: -1668.972311 hartree
dipole: 1.6954 -2.5081 -3.6518
dipole: 4.7435
quadrupole: -115.7608 -157.0669 -138.6538
quadrupole: 13.8092 -5.0848 -1.9436
quadrupole: 21.3997 -19.9064 -1.4933 13.8092 -5.0848 -1.9436
hfenergy: -1669.201495 hartree
pointgroup: C01 [X(C13H16N4O2S2)]
dipole: 0.4531988 -0.1435344 1.8046565 debye
polarizability: 249.4908646|-14.119123|223.0976884|-4.0991854|50.5860852|196.5505206 unknown
InChI: InChI=1S/C13H16N4O2S2/c1-3-15(4-2)13(20)21-9-16-12-7-11(17(18)19)6-5-10(12)8-14-16/h5-8H,3-4,9H2,1-2H3
charge 0 multiplicity 1
37 atoms
S  1.930865 1.341566 1.13293
S  2.504385 0.873076 -1.932739
O  -2.740758 -2.707079 -2.547409
O  -0.571649 -2.017837 -2.670446
N  -0.646326 2.20392 0.423684
N  3.184913 -0.839514 0.085841
N  -1.387402 2.954075 1.350385
N  -1.781506 -1.902067 -2.229164
C  -1.400023 1.15024 -0.098118
C  -2.702938 1.249232 0.506862
C  0.748134 2.521263 0.21787
C  3.810403 -1.7463 -0.924512
C  3.23894 -1.32091 1.495938
C  -1.061127 0.130535 -1.010484
C  -2.61992 2.387089 1.384105
C  -3.709217 0.303919 0.169291
C  2.598634 0.327672 -0.308649
C  -2.086657 -0.788308 -1.297633
C  -3.398278 -0.719027 -0.736005
C  2.802777 -2.774046 -1.478201
C  4.501426 -0.839981 2.242392
H  1.04634 2.441623 -0.846602
H  0.93776 3.524601 0.619123
H  4.204999 -1.120401 -1.742192
H  4.659053 -2.250848 -0.426271
H  2.327832 -0.987127 2.02229
H  3.211288 -2.424702 1.457313
H  -0.075337 0.041461 -1.478381
H  -3.385653 2.813479 2.029372
H  -4.707958 0.367815 0.611701
H  -4.130825 -1.475642 -1.026426
H  2.391662 -3.413326 -0.675459
H  1.965011 -2.269753 -1.987663
H  3.306939 -3.43038 -2.210306
H  5.421377 -1.167599 1.725967
H  4.519716 0.260449 2.319573
H  4.514719 -1.258868 3.264823
