program: Gaussian 09
title: 000267954
version: EM64L-G09RevD.01
frameworkgroup: C1[X(C9H8N4O3)]
method: RPBEPBE
basis: SDD
operation: Freq
keyword: #pfreq=noraman
keyword: PBEPBE/SDD
title: #p freq=noraman PBEPBE/SDD
converged: NO YES NO YES
title: Mulliken charges:
elementType: O O O N N N N C C C C C C C C C H H H H H H H H
charge: -0.267583 -0.206510 -0.195067 -0.296618 -0.028032 -0.382906 0.021419 0.372348 0.156677 -0.457319 -0.322679 0.436741 -0.416125 -0.383098 0.301275 -0.604307 0.348881 0.255900 0.280683 0.288880 0.351817 0.274828 0.235417 0.235379
chargesum: 0.00000
title: Mulliken charges with hydrogens summed into heavy atoms:
elementType: O O O N N N N C C C C C C C C C
charge: -0.267583 -0.206510 -0.195067 -0.296618 -0.028032 -0.031089 0.021419 0.372348 0.156677 -0.108438 -0.066779 0.436741 -0.135442 -0.094218 0.301275 0.141317
polarizability: 2.21435915e+02 3.55703515e+00 1.57096495e+02 3.30816917e-03 -9.48532112e-03 5.72876314e+01
1716.lowfreq: -3.1107 -0.0012 -0.0007 -0.0004 2.5730 4.1770 46.8664 58.9062 88.2365
frequency: 46.8506 58.9034 88.2275 98.3093 98.5954 133.0913 174.3917 199.0604 264.1440 265.0460 311.2373 329.8292 354.6150 401.6670 432.3883 503.5437 545.7300 569.4002 590.6645 622.5192 676.3014 696.5162 711.4749 719.3105 762.5531 762.7108 774.0939 812.3200 830.3376 868.1335 915.6963 947.8561 958.9455 988.2410 1044.5091 1084.2463 1117.6628 1125.3648 1139.0905 1158.7406 1185.3488 1208.6124 1224.3422 1245.0554 1280.7916 1332.6742 1376.2085 1385.9765 1424.5231 1430.1052 1465.2283 1465.8435 1479.8590 1484.2500 1525.8034 1584.3226 1624.6199 1680.7783 2986.2818 3067.4823 3114.6860 3160.8664 3191.9280 3208.1679 3225.8783 3495.8618
redmass: 9.1069 5.7089 3.5705 5.9145 1.2067 5.9667 3.8418 5.9525 6.5055 6.8415 5.7968 7.2929 5.5896 7.8421 3.0915 8.7878 5.1483 5.2172 7.8631 6.2256 8.1898 4.0888 3.0560 1.6816 3.4466 8.5284 5.1477 4.9575 1.3247 1.5861 5.3275 1.4175 4.1568 1.3313 2.0980 4.3668 3.0379 1.2910 1.6847 1.7339 1.7161 7.8622 2.0774 1.6476 3.7765 4.1752 12.8736 5.2859 2.9954 1.2615 4.1738 1.3027 5.3769 1.0435 1.5730 8.1419 8.1141 9.6050 1.0349 1.1026 1.0992 1.0906 1.0954 1.0940 1.0981 1.0774
irintensity: 0.6330 5.1003 1.5992 0.9093 0.0358 2.0216 2.4772 4.5603 4.4321 0.7597 0.6712 12.8624 19.8740 2.6952 5.3901 0.1084 4.0018 0.1201 8.6900 10.2640 7.4429 19.6288 0.2439 143.4235 0.3992 36.6959 26.2170 4.1228 2.6424 52.7912 39.0193 31.8514 42.8352 0.7929 60.8100 8.2652 7.8340 0.0019 19.8139 73.9923 117.7806 308.8192 37.2860 7.3524 15.9980 96.3535 46.5832 159.7729 29.2638 14.5798 0.8314 200.9368 32.2620 17.2012 392.5392 3.6194 3.9380 194.9006 74.4908 31.1484 3.0513 5.2433 2.9859 18.7799 0.9875 53.9397
temp: 298.150 k
press: 1.00000 atm
elementType: 8 8 8 7 7 7 7 6 6 6 6 6 6 6 6 6 1 1 1 1 1 1 1 1
symmnumber: 1
zpe: 448825.8 jmol-1
zpe.correction: 0.170949 hartree
zpe.thermalcorrener: 0.184473 hartree
zpe.thermalcorrenthalpy: 0.185417 hartree
zpe.thermalcorrgfe: 0.129651 hartree
zpe.sumelectzpe: -791.225108 hartree
zpe.sumelectthermal: -791.211583 hartree
zpe.sumelectthermalent: -791.210639 hartree
zpe.sumelectthermalfe: -791.266405 hartree
dipole: 5.2540 5.3919 -0.0003
dipole: 7.5284
quadrupole: -89.3452 -91.7761 -92.5422
quadrupole: -12.3132 0.0008 0.0001
quadrupole: 1.8760 -0.5549 -1.3211 -12.3132 0.0008 0.0001
hfenergy: -791.3960564 hartree
pointgroup: C01 [X(C9H8N4O3)]
dipole: 2.107912 -2.0807709 0.0001355 debye
dipolederiv: -0.7687083 0.0347899 0.000022 -0.0194021 -0.9314478 0.0000328 -0.0000441 0.0000805 -0.3559584 -0.972512 -0.0237686 -0.0000346 0.0439293 -0.4856618 0.0000053 0.0000153 0.0000345 -0.2272096 -0.5209212 0.0452431 0.0000034 0.1588123 -0.8380483 0.0000683 -0.0000252 0.0000076 -0.2178811 -0.8609482 -0.2962596 0.0000447 -1.009289 -0.9664484 0.0001235 0.0001404 0.0000811 -0.0318797 -0.6459236 -0.022821 0.0000087 0.4030009 0.300493 -0.000051 -0.000057 -0.0000411 -0.1753679 -1.4664563 -0.1719975 0.0001181 -0.1139942 -0.4427644 0.0000626 -0.0002956 -0.000017 -0.4703059 1.649715 -0.2630228 0.0000461 -0.5401776 1.3244591 -0.0000899 0.0000966 -0.000107 0.1839713 0.7071076 0.3196876 -0.0000506 0.2253342 -0.2668594 0.0000228 -0.0000201 0.0000217 0.0600346 0.1937918 0.1392844 -0.0000105 -0.295207 -0.23359 0.0000284 0.0000275 0.0000202 0.0296374 0.0207847 -0.3306019 0.0000276 0.0506977 -0.0035169 -0.0000056 -0.0000308 0.0000098 -0.0806232 -0.1293134 -0.0677448 0.0000067 0.1664882 0.1966084 -0.0000169 -0.0000276 -0.000023 -0.1243201 -0.4311983 0.3985055 -0.0000202 0.454624 -0.0299441 -0.0000035 -0.0000403 0.000029 0.0480589 -0.1323621 -0.4013847 0.0000396 -0.233758 0.1466497 -0.0000099 0.0000199 -0.0000156 -0.1017285 -0.0542059 0.1053276 -0.0000064 -0.2747903 -0.1331724 0.0000026 -0.0000119 0.0000101 -0.1333775 2.3023846 0.4048959 -0.0000954 0.6594983 1.5544955 -0.0001279 -0.0000563 -0.000125 0.2893526 0.4420296 0.1563715 -0.0001693 0.4325804 0.2052129 -0.0002343 0.0001083 -0.0001866 0.2585342 0.1872632 -0.0031057 -0.0000003 0.0028791 0.135968 0.0000029 -0.0000038 0.0000019 0.1902989 0.0711558 -0.0171855 0.0000006 -0.0383678 -0.0559633 0.0000133 0.0000094 0.0000137 0.160286 0.0696296 0.0113538 0. 0.0226795 0.0019413 0.0000128 0.0000008 0.0000103 0.1720325 0.0474731 -0.0477276 0.0000018 -0.0023549 0.1350919 0.0000014 0.0000032 0.0000032 0.1769106 0.3365908 0.0179702 0.0000032 0.0480642 0.2233929 0.0000089 0.0000588 -0.0000243 0.3452907 0.1156839 0.1224782 0.0001917 -0.0138518 -0.0001846 -0.000154 0.0001028 -0.000153 0.1340782 -0.0804015 -0.0552166 0.0960331 -0.0639503 0.0816195 -0.0463874 0.1598157 -0.002697 -0.065194 -0.0806591 -0.0550714 -0.09616 -0.0634451 0.081669 0.0466946 -0.1597857 0.0030661 -0.0646401 unknown
polarizability: 221.5498713|-2.3038251|156.9825389|-0.0031231|-0.0095478|57.2876314 unknown
InChI: InChI=1S/C9H8N4O3/c1-10-9(14)12-8-4-7(13(15)16)3-2-6(8)5-11-12/h2-5,10H,1H3
charge 0 multiplicity 1
24 atoms
O  1.893285 1.978085 -0.000273
O  -4.4476 0.750861 -0.000124
O  -2.890561 2.416089 -0.000207
N  1.56759 -0.349249 -0.000003
N  2.139659 -1.633247 0.000091
N  3.742873 0.515587 -0.000081
N  -3.22598 1.171013 -0.000211
C  0.169352 -0.409769 0.000009
C  -0.163155 -1.809719 0.000099
C  -0.81072 0.604734 -0.000054
C  -1.524634 -2.213315 0.000108
C  -2.141157 0.150483 -0.000029
C  1.103322 -2.499966 0.000161
C  -2.517975 -1.225206 0.000038
C  2.411136 0.828448 -0.000105
C  4.7794 1.550613 -0.000346
H  -0.559849 1.666424 -0.000128
H  -1.795205 -3.273298 0.000169
H  1.299504 -3.570609 0.000239
H  -3.581452 -1.475039 0.000034
H  3.980604 -0.482158 -0.000004
H  4.285925 2.535357 0.000857
H  5.416018 1.472656 -0.900243
H  5.417717 1.471229 0.898203
