program: Gaussian 09
title: 000267967
version: EM64L-G09RevD.01
frameworkgroup: C1[X(C11H14Cl2N2O4)]
method: RPBEPBE
basis: SDD
operation: Freq
keyword: #p
keyword: freq=noraman
keyword: PBEPBE/SDD
title: #p freq=noraman PBEPBE/SDD
converged: YES YES NO NO
title: Mulliken charges:
elementType: Cl Cl O O O O N N C C C C C C C C C C C H H H H H H H H H H H H H H
charge: -0.016773 -0.010683 -0.450512 -0.438655 -0.482088 -0.279664 -0.464386 -0.498486 0.300287 -0.438712 -0.400668 -0.401359 0.264122 0.527407 -0.462237 -0.347456 -0.026718 -0.179781 -0.123607 0.255520 0.231940 0.255833 0.205294 0.240435 0.229994 0.301638 0.350496 0.371800 0.358839 0.303774 0.251374 0.315472 0.257562
chargesum: 0.00000
title: Mulliken charges with hydrogens summed into heavy atoms:
elementType: Cl Cl O O O O N N C C C C C C C C C C C
charge: -0.016773 -0.010683 -0.100016 -0.066855 -0.123249 -0.279664 -0.162749 -0.194712 0.300287 0.048748 0.060459 0.069070 0.264122 0.527407 -0.210863 -0.031984 -0.026718 0.077781 -0.123607
polarizability: 2.69135843e+02 5.87086758e-01 1.58656216e+02 5.66563877e-01 -2.30305561e+00 9.99824875e+01
1716.lowfreq: -2.6178 -0.0023 -0.0022 -0.0019 4.4596 12.1660 21.7727 26.7781 57.1342
frequency: 21.7647 26.7113 57.0935 69.9428 74.8316 84.3686 120.7276 127.5423 151.7083 160.6790 177.6364 189.9724 193.1740 213.4120 259.6150 270.6745 276.6563 312.3107 322.0438 334.5683 357.9742 371.5457 419.8503 435.7765 438.7601 445.7936 458.4863 501.0236 534.7925 570.3502 598.5393 623.3895 655.3990 684.3176 688.2059 693.5733 708.1865 764.0714 790.5194 834.1621 857.6456 861.9336 888.8776 919.8023 938.8535 976.2910 977.5827 982.6531 995.4962 998.3991 1028.4840 1094.4824 1100.3663 1122.0513 1132.0091 1147.1180 1169.5127 1182.4155 1218.2167 1237.8896 1249.5116 1279.0678 1287.3430 1295.7602 1345.0402 1356.1841 1377.3293 1384.3217 1391.0169 1394.4805 1446.7106 1464.1576 1468.3082 1478.3032 1480.8270 1500.0952 1579.7183 1606.7353 1642.4100 2973.2604 2997.5705 3012.0327 3038.8308 3122.2332 3123.2877 3140.9358 3166.4000 3202.2976 3468.9071 3470.4884 3532.2620 3549.6880 3596.8675
redmass: 7.5634 8.2469 6.9275 7.5665 6.3669 5.3429 5.9558 5.2256 5.3479 4.2472 9.0537 6.2726 5.0818 5.6190 3.9602 1.8409 2.0220 2.7109 5.2584 3.0218 3.3690 4.5245 2.1803 5.1108 3.0852 2.4523 3.7508 2.6376 2.2459 2.2580 1.8387 4.5931 5.7907 3.1239 2.9945 1.3018 8.2903 3.5617 5.7117 1.3273 1.7125 3.8900 1.8890 2.9226 1.9480 1.3095 3.6676 4.9840 5.4996 5.0777 3.9256 1.5842 1.8513 2.1899 2.1987 1.3345 1.1433 1.2517 1.9739 1.4523 1.4475 1.8934 2.3241 1.3013 3.0641 1.3519 1.2439 1.2497 1.5476 3.5530 1.4119 1.0874 2.5241 1.1004 1.2329 2.3316 5.4637 6.4882 4.6427 1.0554 1.0688 1.0680 1.1091 1.0967 1.0971 1.0924 1.0909 1.0951 1.0741 1.0660 1.0762 1.0657 1.0669
irintensity: 0.9060 0.4557 1.7898 1.1984 1.9875 15.8651 1.7609 12.0848 1.2266 11.5911 1.6261 3.4685 12.2623 3.9117 4.6465 113.0139 36.1780 6.3273 0.2894 20.2319 9.9132 2.4142 55.3988 21.9596 6.9692 99.8254 2.6606 44.4459 39.6013 105.4512 43.9085 40.9088 25.8402 63.4375 7.5317 132.9864 43.2947 2.5691 19.8037 13.9770 64.8521 21.7831 23.4771 2.5943 11.5136 2.3369 43.3238 54.2996 26.9671 204.3167 3.0227 37.9181 33.0797 75.9927 21.9972 1.5732 45.7048 38.8537 279.4079 31.8949 50.0136 74.6914 6.4834 56.0591 208.9874 5.0500 20.1106 16.7910 10.0554 10.4634 267.4505 13.7575 107.3353 31.1338 6.5169 612.5508 121.4350 92.3996 121.0507 29.6171 46.9257 32.4324 35.3730 10.0853 16.5278 5.2576 1.4197 10.7086 38.6006 22.6939 14.3399 7.2690 5.9699
temp: 298.150 k
press: 1.00000 atm
elementType: 17 17 8 8 8 8 7 7 6 6 6 6 6 6 6 6 6 6 6 1 1 1 1 1 1 1 1 1 1 1 1 1 1
symmnumber: 1
zpe: 647614.0 jmol-1
zpe.correction: 0.246663 hartree
zpe.thermalcorrener: 0.266552 hartree
zpe.thermalcorrenthalpy: 0.267496 hartree
zpe.thermalcorrgfe: 0.196596 hartree
zpe.sumelectzpe: -1756.631307 hartree
zpe.sumelectthermal: -1756.611418 hartree
zpe.sumelectthermalent: -1756.610474 hartree
zpe.sumelectthermalfe: -1756.681375 hartree
dipole: -1.7025 2.8895 2.3834
dipole: 4.1144
quadrupole: -159.1164 -123.8738 -119.6657
quadrupole: -8.1146 -12.8896 -4.7502
quadrupole: -24.8977 10.3448 14.5529 -8.1146 -12.8896 -4.7502
hfenergy: -1756.8779704 hartree
pointgroup: C01 [X(C11H14Cl2N2O4)]
dipole: 0.6779911 0.9246737 -1.1426176 debye
polarizability: 269.1224489|-1.1354724|157.26301|0.972133|-9.2620627|101.3890876 unknown
InChI: InChI=1S/C11H14Cl2N2O4/c12-8-2-1-7(3-9(8)13)14-10(19)15-11(4-16,5-17)6-18/h1-3,14-18H,4-6H2
charge 0 multiplicity 1
33 atoms
Cl -5.40927 2.092985 -0.231157
Cl -6.239345 -1.070297 0.231323
O  4.377716 1.815854 1.25365
O  4.910492 -0.939866 1.486009
O  3.282852 0.202627 -2.534369
O  0.760045 -1.327025 0.423207
N  1.900556 0.674025 -0.089517
N  -0.433046 0.675855 0.037545
C  3.258931 0.049956 -0.126046
C  4.272206 1.225234 -0.093945
C  3.49605 -0.87156 1.123523
C  3.441885 -0.76037 -1.424832
C  0.742448 -0.093517 0.137606
C  -1.774582 0.216997 0.096525
C  -2.798581 1.188593 -0.062953
C  -2.130222 -1.14413 0.30107
C  -4.151112 0.805762 -0.021589
C  -3.490369 -1.507307 0.334928
C  -4.508124 -0.544158 0.175007
H  5.280874 0.852125 -0.319878
H  4.005443 1.993387 -0.844161
H  3.186405 -1.903544 0.908224
H  2.879954 -0.498898 1.9652
H  2.671709 -1.554972 -1.472549
H  4.451581 -1.218442 -1.430467
H  1.804151 1.432812 -0.775568
H  3.472056 2.096177 1.544471
H  5.152514 -0.04477 1.851911
H  3.335909 -0.269931 -3.400436
H  -0.314915 1.687237 -0.051831
H  -2.552484 2.244039 -0.223481
H  -1.347519 -1.890896 0.438466
H  -3.76961 -2.55318 0.492612
