program: Gaussian 09
title: 000267964
version: EM64L-G09RevD.01
frameworkgroup: C1[X(C14H22O2)]
method: RPBEPBE
basis: SDD
operation: Freq
keyword: #pfreq=noraman
keyword: PBEPBE/SDD
title: #p freq=noraman PBEPBE/SDD
converged: YES YES NO NO
title: Mulliken charges:
elementType: O O C C C C C C C C C C C C C C H H H H H H H H H H H H H H H H H H H H H H
charge: -0.280514 -0.269865 -0.549033 -0.463148 0.461227 -0.306667 0.375632 -0.820162 -0.368913 -0.783082 -0.792577 -0.133317 -0.369535 0.221173 -0.226190 -0.674753 0.220818 0.221957 0.219497 0.213835 0.218769 0.238773 0.239315 0.228115 0.229372 0.216332 0.217165 0.228588 0.222617 0.225697 0.220729 0.250151 0.250645 0.225826 0.225392 0.208510 0.228778 0.228841
chargesum: 0.00000
title: Mulliken charges with hydrogens summed into heavy atoms:
elementType: O O C C C C C C C C C C C C C C
charge: -0.280514 -0.269865 -0.106258 -0.029816 0.461227 -0.087898 0.375632 -0.113958 -0.139541 -0.120998 -0.123534 0.116834 -0.118889 0.221173 0.225028 -0.008624
polarizability: 3.38956098e+02 2.10045483e+01 1.44616864e+02 9.72087308e+00 -3.49388714e+00 1.01922965e+02
1716.lowfreq: -8.5091 -3.7723 -0.0010 -0.0008 0.0008 5.5537 14.7803 23.6898 33.7420
frequency: 14.5138 23.6624 33.6172 39.3534 48.9043 64.8085 72.7194 91.7151 112.4658 129.0186 149.6648 156.7866 183.0271 192.8172 215.3726 238.2810 259.9774 274.6976 293.2542 322.4363 353.3051 356.6127 388.5597 428.0744 432.8720 463.6956 497.1535 542.3722 604.4153 681.5026 699.7611 753.4187 798.8017 800.8016 810.7851 831.6811 855.6130 861.7795 913.6655 948.0961 954.1292 970.2571 984.2510 994.1934 996.4287 1002.8661 1031.0414 1037.2974 1053.6531 1082.6562 1103.7030 1114.8502 1121.2098 1135.6673 1147.3693 1171.7301 1222.5683 1228.0799 1248.6494 1256.6924 1270.6977 1275.9661 1297.2696 1314.3134 1355.4848 1355.8024 1376.2782 1389.8281 1398.5770 1399.6905 1400.6344 1455.0838 1456.0477 1463.3420 1463.5338 1468.2033 1472.6197 1473.3279 1473.7478 1475.2460 1483.9953 1487.2146 1594.3341 1614.4498 1650.3010 1693.8682 2958.3635 2964.4702 2965.4682 2972.0444 2978.9457 2994.1459 3004.5689 3029.2112 3030.0967 3033.5312 3040.2620 3054.7251 3061.3363 3072.6303 3080.4913 3087.2421 3090.7267 3093.0077 3103.5195 3105.1471 3118.7787 3150.6729
redmass: 3.3159 3.7153 3.0859 3.2127 3.2514 3.4713 3.1857 2.6565 1.5554 1.0486 1.7694 3.6858 1.2082 2.5311 1.8020 2.9672 1.4648 4.4619 2.4596 3.0342 3.0338 3.2669 2.3607 2.9925 2.8313 2.7100 2.5518 2.9706 2.8736 4.9776 6.0364 1.6268 1.1019 1.8560 2.7196 2.2749 1.7911 1.7935 1.8341 1.3881 4.5554 1.5109 2.2863 1.2873 1.5445 1.5336 2.5680 1.6307 1.7819 1.6652 2.4852 1.9740 2.1370 1.4689 1.6216 2.0052 2.0788 1.8632 1.1347 1.3888 1.1601 1.7101 1.5200 1.4259 1.4094 1.4224 1.5462 1.3071 1.2662 1.2776 1.2321 1.0759 1.0565 1.0404 1.0632 1.0851 1.0769 1.0514 1.0582 1.0764 1.0883 1.0694 9.0164 6.5972 5.8072 6.4537 1.0372 1.0538 1.0453 1.0404 1.0633 1.0359 1.0579 1.0969 1.0969 1.0964 1.0957 1.0954 1.1065 1.0952 1.0959 1.0898 1.0985 1.0957 1.0961 1.1022 1.0897 1.0912
irintensity: 0.0976 0.0662 0.6736 0.2031 0.1758 2.0174 0.9592 0.0293 0.6262 0.0929 3.9769 2.3704 0.5452 0.4316 1.0446 1.5471 1.8898 6.3302 0.6334 1.4879 5.8450 11.6227 3.1490 2.4957 3.8117 2.8037 2.6850 2.8685 19.5605 7.4543 4.3621 5.1014 3.6424 1.4230 9.9325 7.8325 13.4740 5.3507 18.1662 1.0049 77.5322 1.0236 5.7134 5.4805 22.5968 47.7398 115.0672 3.2948 0.2282 3.8315 419.1065 57.5332 105.8392 5.1114 26.4109 1.1542 37.9278 7.3976 0.0265 10.4629 1.0810 244.8134 40.1581 3.8802 0.1291 5.3366 57.5429 23.1546 36.8346 11.1124 13.9260 3.7676 0.8819 11.4232 0.9763 26.7399 9.0201 43.9045 6.5135 8.5182 13.5372 11.7875 277.0879 155.2434 215.2805 4.3794 44.3882 14.7259 52.7514 30.5393 45.6111 28.9943 24.8141 3.2659 7.8277 46.1542 23.3226 18.1248 11.8128 15.0149 60.7023 17.7842 35.8565 49.3180 16.9663 46.8675 11.5827 9.2776
temp: 298.150 k
press: 1.00000 atm
elementType: 8 8 6 6 6 6 6 6 6 6 6 6 6 6 6 6 1 1 1 1 1 1 1 1 1 1 1 1 1 1 1 1 1 1 1 1 1 1
symmnumber: 1
zpe: 851421.7 jmol-1
zpe.correction: 0.324289 hartree
zpe.thermalcorrener: 0.344443 hartree
zpe.thermalcorrenthalpy: 0.345387 hartree
zpe.thermalcorrgfe: 0.271905 hartree
zpe.sumelectzpe: -695.850786 hartree
zpe.sumelectthermal: -695.830632 hartree
zpe.sumelectthermalent: -695.829688 hartree
zpe.sumelectthermalfe: -695.903171 hartree
dipole: 2.7661 -0.9593 0.3106
dipole: 2.9442
quadrupole: -81.2414 -98.8830 -100.8244
quadrupole: 9.2117 1.1068 0.2298
quadrupole: 12.4082 -5.2334 -7.1748 9.2117 1.1068 0.2298
hfenergy: -696.1750757 hartree
pointgroup: C01 [X(C14H22O2)]
dipole: 1.0940866 0.3624568 -0.115343 debye
polarizability: 338.0405997|-24.0329639|145.5909754|-11.9219912|-1.6419519|101.8643516 unknown
InChI: InChI=1S/C14H22O2/c1-5-16-14(15)11-7-10-13(4)9-6-8-12(2)3/h7-8,10-11H,5-6,9H2,1-4H3
charge 0 multiplicity 1
38 atoms
O  -5.002229 0.76081 0.041259
O  -4.257236 -1.451306 0.227017
C  2.289642 0.11461 -0.678518
C  3.270103 0.016199 0.53975
C  0.963428 -0.593287 -0.454062
C  4.520457 0.842257 0.318502
C  5.801728 0.402471 0.149462
C  1.037102 -2.096267 -0.269696
C  -0.207839 0.132943 -0.416695
C  6.938675 1.388491 -0.072619
C  6.227041 -1.055628 0.169029
C  -1.543395 -0.392757 -0.202913
C  -2.67922 0.379627 -0.16688
C  -4.001375 -0.229046 0.051516
C  -6.395068 0.273135 0.25216
C  -7.304216 1.496973 0.190302
H  2.805788 -0.321349 -1.558694
H  2.115106 1.183913 -0.903827
H  2.735998 0.385234 1.438892
H  3.520994 -1.042353 0.729824
H  4.349677 1.930132 0.277433
H  0.051818 -2.586836 -0.288975
H  1.516717 -2.350224 0.696168
H  1.663556 -2.550605 -1.061502
H  -0.135923 1.221366 -0.561526
H  7.451954 1.193836 -1.035554
H  7.708051 1.293554 0.719637
H  6.581311 2.432845 -0.078935
H  6.9591 -1.236686 0.981136
H  5.385659 -1.753161 0.311071
H  6.735133 -1.324589 -0.778411
H  -1.681321 -1.472933 -0.057408
H  -2.648019 1.466593 -0.297993
H  -6.63004 -0.469214 -0.532669
H  -6.44277 -0.240552 1.229999
H  -8.356015 1.192555 0.34212
H  -7.036192 2.225886 0.974268
H  -7.224477 1.996663 -0.79037
