program: Gaussian 09
title: 000267935
version: EM64L-G09RevD.01
frameworkgroup: C1[X(C9H9NO5)]
method: RPBEPBE
basis: SDD
operation: Freq
keyword: #pfreq=noraman
keyword: PBEPBE/SDD
title: #p freq=noraman PBEPBE/SDD
converged: YES YES NO NO
title: Mulliken charges:
elementType: O O O O O N C C C C C C C C C H H H H H H H H H
charge: -0.266949 -0.269841 -0.169481 -0.169675 -0.191762 -0.001760 0.223908 0.128343 0.226005 0.232233 -0.345749 -0.341201 -0.190664 -0.535288 -0.531670 0.266131 0.254363 0.225441 0.251807 0.251380 0.242333 0.228629 0.254760 0.228706
chargesum: 0.00000
title: Mulliken charges with hydrogens summed into heavy atoms:
elementType: O O O O O N C C C C C C C C C
charge: -0.266949 -0.269841 -0.169481 -0.169675 -0.191762 -0.001760 0.223908 0.128343 0.226005 0.232233 -0.079619 -0.086837 0.034776 0.210232 0.180425
polarizability: 1.76291129e+02 -1.42081689e+00 1.43309777e+02 3.61656483e-02 4.14254733e-02 7.29965223e+01
1716.lowfreq: -16.0602 -6.3151 -0.5538 -0.0008 -0.0006 -0.0003 6.8925 39.6070 76.2780
frequency: -15.9981 39.5731 76.2759 103.8135 121.9092 169.0513 174.5845 182.9154 184.4089 204.0975 230.9689 242.6270 269.4976 294.5828 352.8781 373.1909 391.4240 417.5725 494.0563 532.5941 571.1248 615.5444 632.3140 646.0834 694.1003 728.0827 732.5674 817.8812 871.6712 920.0710 945.1058 980.4371 1015.4605 1035.5935 1106.9364 1113.3380 1135.6771 1150.1436 1165.5646 1186.4522 1225.9989 1242.4456 1258.8121 1361.1253 1379.4667 1380.8371 1417.4164 1427.8122 1444.5136 1466.7247 1470.4731 1475.0504 1476.5219 1485.2558 1563.3475 1585.9680 1617.3630 2971.2901 2988.3636 3001.0983 3064.8580 3105.3900 3136.3346 3137.6268 3163.2873 3183.6825
redmass: 3.0490 10.3263 3.7113 5.4254 4.7869 6.0882 7.1730 7.3789 3.3606 4.6467 1.1184 1.1210 5.3681 4.8950 4.9151 5.7539 5.2437 6.2856 5.9725 3.9928 6.8744 7.7604 5.4810 5.1047 7.6645 6.3025 10.1408 1.4925 8.1376 7.6581 1.3451 1.7652 10.0971 5.1674 1.2456 1.2536 2.4370 1.5124 1.4139 1.4356 4.2775 3.9586 5.7544 2.2509 2.9667 10.6383 3.1419 1.4375 1.2169 1.4034 1.0497 1.0766 1.3138 1.0779 8.2450 7.3508 6.7605 1.0326 1.0873 1.0301 1.1047 1.1063 1.1002 1.1031 1.0878 1.0965
irintensity: 9.4433 0.2290 0.8980 0.0284 8.3661 7.0718 0.0708 13.4177 4.3651 4.5225 0.8482 0.3368 5.3912 5.6985 0.8295 2.0858 2.4960 5.4390 14.5660 1.0057 30.1161 8.3535 0.2881 30.0512 14.2398 0.6247 20.1037 54.3835 0.7802 13.3815 0.3316 2.1109 78.8406 75.4612 0.0783 0.0484 8.9787 8.7267 6.2989 29.3666 35.7584 289.2218 145.4967 4.4757 77.1304 179.8845 112.9031 102.4671 0.8649 193.8797 15.9987 8.2709 23.8853 76.2029 25.8419 122.6594 44.4512 64.7399 43.0967 41.0051 38.5045 17.6915 15.8295 14.5468 3.4160 4.7916
temp: 298.150 k
press: 1.00000 atm
elementType: 8 8 8 8 8 7 6 6 6 6 6 6 6 6 6 1 1 1 1 1 1 1 1 1
symmnumber: 1
zpe: 448307.9 jmol-1
zpe.correction: 0.170751 hartree
zpe.thermalcorrener: 0.184727 hartree
zpe.thermalcorrenthalpy: 0.185671 hartree
zpe.thermalcorrgfe: 0.129926 hartree
zpe.sumelectzpe: -777.973777 hartree
zpe.sumelectthermal: -777.959802 hartree
zpe.sumelectthermalent: -777.958858 hartree
zpe.sumelectthermalfe: -778.014603 hartree
dipole: 4.8901 -5.9905 0.0389
dipole: 7.7331
quadrupole: -63.9604 -94.8020 -90.7484
quadrupole: 3.2977 -0.0945 -0.0553
quadrupole: 19.2099 -11.6317 -7.5782 3.2977 -0.0945 -0.0553
hfenergy: -778.1445288 hartree
pointgroup: C01 [X(C9H9N1O5)]
dipole: -1.4598736 2.6692784 0.0120767 debye
dipolederiv: -1.701486 -0.274749 0.0153055 -0.2385486 -0.261811 0.0012166 0.0247334 0.0072371 -0.2890071 -1.8194096 0.4037349 0.0155286 -0.0356153 -0.2324096 0.0000606 0.019329 -0.0055181 -0.2792308 -0.5414166 0.1550974 -0.1624338 0.1320533 -0.3763992 0.1143861 -0.1781585 -0.023722 -0.668726 -0.5348734 0.1574189 0.1589478 0.13213 -0.3766073 -0.1197523 0.1728496 0.0175789 -0.6741446 -0.481555 0.306605 0.0006444 -0.1165176 -1.0767409 0.0065843 0.0040647 0.0010356 -0.2712711 0.8838297 -0.3854874 0.0047331 -0.1902991 0.5899853 0.0044882 0.0054022 0.0075616 1.2179512 -0.0594066 0.3836287 -0.0027336 -0.2755691 0.2524083 0.0008282 0.0045722 -0.0076625 -0.1030276 -0.2041761 -0.52722 0.0067985 0.0390067 -0.8381034 0.0055999 0.0022587 0.0146683 0.027896 1.315735 0.5510336 -0.0189866 0.6853627 -0.3190146 -0.0018717 -0.0279505 -0.005307 0.1086541 1.4309245 -0.2235221 -0.0148177 0.4982171 -0.0549231 -0.0051236 -0.020573 0.0039302 0.0796247 -0.0112376 -0.3869067 0.0008855 0.1350678 0.2065552 -0.0047069 -0.0041989 0.0006517 -0.1195891 -0.2992899 0.1498233 0.0001496 -0.3987481 0.1267912 0.0025833 0.0045151 -0.0038552 -0.1765246 0.5635552 0.1019924 -0.0073406 0.0459815 1.5797999 -0.010408 -0.0067653 -0.0111762 0.1101783 0.795771 -0.0110976 -0.0026294 -0.3295669 0.1758639 0.0021355 -0.0002391 -0.0007726 0.2311711 0.7534621 -0.2263945 -0.0034694 -0.4972106 0.419733 0.0052251 -0.0014489 0.0019715 0.3165016 0.083182 -0.0433314 0.0013674 -0.038228 -0.002022 0.0016994 0.0011804 0.0016594 0.1594715 0.0117831 0.0978007 0.0010527 0.0889363 0.015727 0.0000737 0.0013364 0.0000833 0.1646658 -0.1500774 -0.0754456 0.0041058 0.0041143 0.077209 0.0001611 0.0033735 0.0009674 0.1121078 0.0359513 -0.0003493 -0.0535382 0.1451311 0.053084 -0.097535 0.0098529 -0.0787585 -0.0302643 0.0338463 0.0002307 0.0534534 0.1450498 0.0593992 0.0937434 -0.0156839 0.075813 -0.0369186 -0.082926 -0.0788362 0.0025053 -0.1273518 0.005243 0.0029589 0.0031483 0.0026187 0.1420663 0.0398181 -0.0229198 -0.0586032 0.1460204 -0.0416898 -0.1029572 0.0073498 -0.1077042 -0.0725821 -0.1030125 -0.0320263 0.0032518 -0.0979793 0.0561136 0.0019132 0.0038227 0.0010643 0.1282504 0.0410083 -0.0190797 0.055823 0.1485634 -0.0381919 0.0986974 -0.0127706 0.1076353 -0.0772528 unknown
polarizability: 174.6614293|-7.267541|144.922071|-1.1463149|-0.4860834|73.0139284 unknown
InChI: InChI=1S/C9H9NO5/c1-14-7-3-4-8(15-2)9(10(12)13)6(7)5-11/h3-5H,1-2H3
charge 0 multiplicity 1
24 atoms
O  2.43789 1.701182 0.286584
O  -3.015509 0.260373 0.369838
O  2.097621 -1.656138 1.465028
O  2.076467 -1.668016 -0.819993
O  -0.463364 -2.857183 0.359643
N  1.654442 -1.259328 0.324532
C  0.668252 -0.132918 0.327532
C  -0.723587 -0.444977 0.347392
C  1.135699 1.204961 0.310424
C  -1.66774 0.62609 0.350378
C  0.15766 2.238564 0.314369
C  -1.215995 1.969953 0.333662
C  -1.216262 -1.844457 0.363489
C  3.643711 0.847729 0.300143
C  -4.023323 1.327825 0.374023
H  0.529754 3.267241 0.301412
H  -1.921425 2.804289 0.33579
H  -2.320948 -1.946863 0.379001
H  3.687637 0.203217 -0.593868
H  3.692415 0.239477 1.219027
H  4.474273 1.567473 0.283265
H  -3.927109 1.963748 1.274291
H  -4.988935 0.803125 0.391136
H  -3.950926 1.948531 -0.538999
