program: Gaussian 09
title: 000267939
version: EM64L-G09RevD.01
frameworkgroup: C1[X(C8H14N4O4)]
method: RPBEPBE
basis: SDD
operation: Freq
keyword: #p
keyword: freq=noraman
keyword: PBEPBE/SDD
title: #p freq=noraman PBEPBE/SDD
converged: YES YES NO NO
title: Mulliken charges:
elementType: O O O O N N N N C C C C C C C C H H H H H H H H H H H H H H
charge: -0.316387 -0.316382 -0.238718 -0.238721 0.015104 0.015113 -0.378398 -0.378399 0.104706 0.104752 -0.736125 -0.736113 0.316452 0.316451 -0.603235 -0.603237 0.241183 0.291382 0.241348 0.241371 0.241160 0.291380 0.327643 0.327641 0.232037 0.270988 0.231992 0.232031 0.231994 0.270987
chargesum: 0.00000
title: Mulliken charges with hydrogens summed into heavy atoms:
elementType: O O O O N N N N C C C C C C C C
charge: -0.316387 -0.316382 -0.238718 -0.238721 0.015104 0.015113 -0.050755 -0.050758 0.104706 0.104752 0.037787 0.037798 0.316452 0.316451 0.131781 0.131776
polarizability: 2.70048186e+02 -2.70076613e+00 1.26019581e+02 -1.43931099e-02 -2.12265944e-02 7.48514461e+01
1716.lowfreq: -9.0291 0.0006 0.0008 0.0011 1.4526 2.6383 22.7064 25.2384 28.5035
frequency: 22.7064 25.2384 28.3190 48.1082 69.6057 89.3699 94.5829 94.5909 100.7933 108.2359 113.9868 157.0506 168.4109 198.0062 204.0198 207.9719 246.2297 269.9691 310.3118 321.2395 338.6142 449.8371 451.0357 471.0728 559.3727 570.9406 574.1257 574.8456 582.6860 644.9831 685.4711 685.5243 731.4847 798.8960 867.2071 877.6792 881.8532 913.2567 983.3144 1021.5328 1034.2845 1036.7424 1046.9254 1049.3667 1125.3808 1125.4000 1126.0526 1146.6876 1146.8275 1187.6196 1192.3792 1346.5138 1387.3127 1387.8526 1431.9152 1431.9508 1454.4901 1455.3625 1457.5742 1466.3522 1470.3484 1471.5880 1484.1690 1484.1787 1509.2690 1512.5557 1537.8665 1543.0026 1734.7273 1736.1065 2981.7664 2981.9866 2997.3727 2997.4670 3060.5393 3060.5567 3076.2475 3076.3508 3114.3639 3114.3641 3135.3923 3135.4335 3573.2495 3573.3342
redmass: 4.5510 5.0154 4.0065 4.7752 4.3780 3.3564 1.0967 1.0991 4.8426 1.1145 1.0481 3.2793 3.9466 6.6507 4.2673 6.3627 3.4163 3.2629 5.9793 4.3710 12.3638 4.5339 4.6457 4.1899 7.0958 6.4520 1.1203 1.1194 3.0801 6.2386 11.9638 12.0883 4.1503 3.5214 7.2207 5.4450 6.6415 5.3751 2.6155 2.0882 1.4554 4.8753 1.6143 4.8438 1.2808 1.2808 2.5559 1.6286 1.6077 2.4118 2.3499 3.7698 1.2203 1.2163 1.1568 1.1559 1.0729 1.3606 1.3138 1.2538 1.0488 1.0466 1.0440 1.0440 1.3166 1.3615 7.7384 7.1987 10.1819 10.1128 1.0353 1.0353 1.0372 1.0374 1.1027 1.1027 1.0966 1.0966 1.0984 1.0984 1.1001 1.1000 1.0772 1.0772
irintensity: 17.9327 1.4748 0.0000 6.6488 0.0000 8.7042 0.0642 1.0085 0.0000 0.0240 0.0001 0.7158 0.0000 0.0000 21.0474 0.3874 0.0000 0.1258 31.6380 0.0000 0.0000 10.6753 0.0002 1.9280 0.0001 21.7909 0.0016 283.2667 0.0000 0.0002 0.2205 35.6109 4.2289 0.0000 1138.8357 0.0013 35.5233 0.0015 310.2304 0.0001 5.2988 681.5988 0.0000 0.0014 0.0145 0.0008 37.9533 76.3346 0.0136 412.5588 0.0010 0.0000 0.0001 93.5987 49.2096 0.3277 24.3658 464.3266 0.0007 0.0002 0.0007 34.1938 0.0791 32.8937 347.8636 0.0010 8.6014 0.0008 530.7076 0.0009 180.1937 0.0117 0.0021 14.4109 1.4328 71.2153 21.9080 0.0260 2.7673 4.9280 2.8589 0.0195 73.0077 0.4898
temp: 298.150 k
press: 1.00000 atm
elementType: 8 8 8 8 7 7 7 7 6 6 6 6 6 6 6 6 1 1 1 1 1 1 1 1 1 1 1 1 1 1
symmnumber: 1
zpe: 603765.5 jmol-1
zpe.correction: 0.229962 hartree
zpe.thermalcorrener: 0.249414 hartree
zpe.thermalcorrenthalpy: 0.250358 hartree
zpe.thermalcorrgfe: 0.178892 hartree
zpe.sumelectzpe: -831.840675 hartree
zpe.sumelectthermal: -831.821223 hartree
zpe.sumelectthermalent: -831.820279 hartree
zpe.sumelectthermalfe: -831.891744 hartree
dipole: -0.0008 -0.0004 0.0022
dipole: 0.0023
quadrupole: -52.3264 -96.4394 -94.0507
quadrupole: -32.6948 0.0048 -0.0040
quadrupole: 28.6125 -15.5005 -13.1119 -32.6948 0.0048 -0.0040
hfenergy: -832.0706367 hartree
pointgroup: C01 [X(C8H14N4O4)]
dipole: 0.0002997 -0.0008526 0.0001765 debye
polarizability: 270.0235358|-0.0026654|74.8518626|3.2930338|-0.1477257|126.0438153 unknown
InChI: InChI=1S/C8H14N4O4/c1-5(11-15-7(13)9-3)6(2)12-16-8(14)10-4/h9-10H,1-4H3
charge 0 multiplicity 1
30 atoms
O  2.92533 -0.170869 -0.366701
O  -2.925264 -0.173558 0.364522
O  4.137533 -0.175714 1.712826
O  -4.1379 -0.167678 -1.714748
N  1.70517 -0.172717 0.437918
N  -1.705346 -0.171311 -0.440417
N  5.183374 -0.170176 -0.397892
N  -5.18326 -0.173409 0.396211
C  0.648773 -0.171278 -0.365134
C  -0.648973 -0.172927 0.362627
C  0.696632 -0.167874 -1.876082
C  -0.696885 -0.176624 1.873579
C  4.11599 -0.172654 0.469706
C  -4.116081 -0.171099 -0.471633
C  6.568503 -0.17161 0.080961
C  -6.568493 -0.172379 -0.082337
H  1.252935 -1.050552 -2.239631
H  -0.320999 -0.173066 -2.290182
H  1.241022 0.723899 -2.235856
H  -1.240157 -1.069138 2.233103
H  -1.254311 0.705302 2.23734
H  0.320717 -0.170176 2.287734
H  4.981988 -0.167973 -1.398097
H  -4.981643 -0.176254 1.396369
H  7.110542 -1.071682 -0.263005
H  6.547705 -0.17212 1.182183
H  7.111911 0.727854 -0.262317
H  -7.111087 0.726772 0.263097
H  -7.111187 -1.072762 0.259717
H  -6.547936 -0.170323 -1.183562
