program: Gaussian 09
title: 000267941
version: EM64L-G09RevD.01
frameworkgroup: C1[X(C15H14N2O2)]
method: RPBEPBE
basis: SDD
operation: Freq
keyword: #p
keyword: freq=noraman
keyword: PBEPBE/SDD
title: #p freq=noraman PBEPBE/SDD
converged: YES YES NO NO
title: Mulliken charges:
elementType: O O N N C C C C C C C C C C C C C C C H H H H H H H H H H H H H H
charge: -0.342665 -0.218178 -0.468186 0.003332 0.309675 0.119887 -0.356924 -0.339489 0.482800 -0.241270 -0.227827 -0.790799 -0.436997 -0.353783 -0.230261 -0.195261 -0.208581 -0.256158 0.255650 0.236409 0.286640 0.227183 0.231416 0.244766 0.267592 0.244930 0.220365 0.296708 0.231440 0.323215 0.226904 0.227761 0.229703
chargesum: 0.00000
title: Mulliken charges with hydrogens summed into heavy atoms:
elementType: O O N N C C C C C C C C C C C C C C C
charge: -0.342665 -0.218178 -0.144971 0.003332 0.309675 0.119887 -0.120515 -0.052849 0.482800 -0.014087 0.003589 -0.033510 -0.216632 -0.057075 0.001179 0.031643 0.019180 -0.026454 0.255650
polarizability: 3.52790539e+02 -1.98225877e+00 1.85023566e+02 1.48849559e-01 -4.92667280e-01 7.55412473e+01
1716.lowfreq: -9.0883 -0.0009 -0.0006 0.0005 4.0089 8.1349 17.1431 27.1702 37.4476
frequency: 14.5808 26.1222 37.3750 46.6627 68.6237 92.8515 130.7301 141.9894 157.0071 182.9139 247.6343 251.0126 285.0991 319.5199 338.2330 387.5319 401.5307 408.7275 442.5411 452.6728 508.4158 566.5697 588.0934 599.1292 615.1139 618.6062 631.9563 685.3166 696.5766 697.4045 702.9427 767.1336 774.4098 793.1583 816.4865 841.7373 856.8793 895.4657 914.7493 919.9236 935.4163 972.2496 972.8288 984.7921 986.8050 989.2995 997.3312 1008.4958 1025.4639 1028.1807 1037.5317 1084.4766 1090.5238 1094.8228 1125.3624 1173.3621 1175.4257 1191.4255 1195.8920 1258.0161 1313.6532 1323.3183 1326.0612 1381.9601 1385.2766 1387.9336 1431.4637 1433.8753 1459.7494 1478.4403 1486.0446 1487.4172 1510.5745 1554.3525 1591.9295 1601.6208 1613.6054 1617.9527 1716.3309 2995.1789 3072.2117 3112.8695 3127.6342 3133.5143 3138.1038 3139.4544 3145.2979 3151.8842 3163.1273 3166.0350 3172.7497 3189.7034 3539.3102
redmass: 4.6009 3.7827 4.6155 5.6678 5.9941 5.8014 5.5985 5.8733 1.0515 5.7995 4.2406 5.7228 6.6608 3.8815 6.1872 6.7334 2.8346 2.9239 3.5809 5.3288 2.8097 2.8862 5.6479 6.9098 6.4306 6.6099 1.2700 6.2092 2.0302 1.8237 7.3985 1.6689 1.7697 4.5576 6.4859 1.2646 1.2490 8.6410 1.4287 10.4146 1.4010 1.3542 2.3613 6.1318 1.3654 5.9614 1.3046 1.3344 2.4559 2.1790 1.5946 1.9339 1.6215 1.7699 3.4774 1.0499 1.0530 1.1118 1.1221 2.0690 2.7424 1.5954 1.4036 5.5172 4.4357 1.4385 2.3110 2.3305 1.1551 1.0471 2.1616 2.3102 2.1947 4.8984 6.4175 5.3539 6.0570 6.0567 10.1257 1.0394 1.0973 1.0885 1.0849 1.0869 1.0917 1.0933 1.0935 1.0931 1.0966 1.0995 1.0996 1.0954 1.0759
irintensity: 0.9409 0.0256 1.9081 0.4355 2.7951 1.7551 6.1305 0.5706 0.8434 1.9377 3.1406 2.5773 0.1568 0.6533 3.2989 5.3482 0.0309 0.0068 3.3161 1.5636 27.5573 10.0449 4.3004 3.8569 0.0284 2.7976 34.1157 18.5452 34.5752 72.0536 35.0597 105.3629 57.0026 0.3685 87.7624 0.2235 0.2171 125.9777 14.1514 807.4842 4.9426 0.0726 86.1573 0.1572 0.1902 2.1739 2.3430 0.8224 7.5844 0.6609 0.4784 7.0380 55.7039 8.0622 392.3956 0.5824 0.0479 2.0714 4.3387 13.2737 60.8474 8.1767 70.2433 11.6944 75.3096 38.1848 132.2288 45.1480 4.3208 18.7439 4.6897 12.8519 671.6891 14.1909 1.0820 33.6268 1.5549 104.6381 197.5400 14.0552 10.8476 14.8129 0.7329 0.2561 13.2460 9.1939 30.2974 27.2578 21.5209 26.4882 15.5129 6.3693 23.9685
temp: 298.150 k
press: 1.00000 atm
elementType: 8 8 7 7 6 6 6 6 6 6 6 6 6 6 6 6 6 6 6 1 1 1 1 1 1 1 1 1 1 1 1 1 1
symmnumber: 1
zpe: 673496.1 jmol-1
zpe.correction: 0.256521 hartree
zpe.thermalcorrener: 0.273557 hartree
zpe.thermalcorrenthalpy: 0.274501 hartree
zpe.thermalcorrgfe: 0.208615 hartree
zpe.sumelectzpe: -838.576563 hartree
zpe.sumelectthermal: -838.559527 hartree
zpe.sumelectthermalent: -838.558583 hartree
zpe.sumelectthermalfe: -838.624470 hartree
dipole: 0.8924 3.9786 -0.0505
dipole: 4.0778
quadrupole: -83.6316 -97.8538 -117.5432
quadrupole: -1.3754 0.1496 -0.0355
quadrupole: 16.0446 1.8224 -17.8670 -1.3754 0.1496 -0.0355
hfenergy: -838.8330846 hartree
pointgroup: C01 [X(C15H14N2O2)]
dipole: 0.3295614 -1.5699745 -0.0201686 debye
polarizability: 352.7982595|-0.2910968|184.9608891|-2.0542317|2.1465194|75.5962032 unknown
InChI: InChI=1S/C15H14N2O2/c1-12(13-8-4-2-5-9-13)17-19-15(18)16-14-10-6-3-7-11-14/h2-11,16H,1H3
charge 0 multiplicity 1
33 atoms
O  -0.068895 -0.725923 -0.001441
O  -1.085981 1.447206 0.025334
N  -2.309223 -0.584961 0.039154
N  1.223462 -0.022466 0.014415
C  3.582544 -0.246016 -0.010776
C  2.229707 -0.880744 -0.028237
C  4.756465 -1.046504 -0.048158
C  3.723285 1.17193 0.043892
C  -3.665635 -0.154119 0.052329
C  6.036517 -0.449427 -0.03153
C  5.000495 1.762585 0.060324
C  2.104184 -2.38866 -0.0905
C  -4.66784 -1.161292 0.064751
C  -4.039273 1.215684 0.053125
C  6.164966 0.955953 0.022789
C  -6.031114 -0.804223 0.07761
C  -5.409542 1.554613 0.065801
C  -6.412064 0.557992 0.078076
C  -1.173362 0.208227 0.023248
H  4.680815 -2.137876 -0.089985
H  2.820139 1.788691 0.072388
H  6.930743 -1.081839 -0.060834
H  5.0921 2.853526 0.102193
H  2.599471 -2.852806 0.781819
H  1.050493 -2.698331 -0.102548
H  2.59852 -2.778708 -0.998783
H  -4.379495 -2.220559 0.064272
H  -3.267937 1.988424 0.044263
H  7.15786 1.419033 0.035665
H  -2.139703 -1.593146 0.039241
H  -6.79404 -1.590417 0.087175
H  -5.692882 2.613141 0.066227
H  -7.471078 0.836213 0.088001
