program: Gaussian 09
title: 000267909
version: EM64L-G09RevD.01
frameworkgroup: C1[X(C9H15N3O2S)]
method: RPBEPBE
basis: SDD
operation: Freq
keyword: #p
keyword: freq=noraman
keyword: PBEPBE/SDD
title: #p freq=noraman PBEPBE/SDD
converged: YES YES NO NO
title: Mulliken charges:
elementType: S O O N N N C C C C C C C C C H H H H H H H H H H H H H H H
charge: 0.306153 -0.203517 -0.243065 -0.393377 0.085786 -0.420442 -0.359578 -0.347204 -0.351634 -0.355024 -0.674803 -0.693338 -0.345581 0.243486 0.233807 0.192432 0.192248 0.189899 0.190162 0.214981 0.215562 0.195228 0.195435 0.279177 0.278942 0.210881 0.210744 0.217565 0.372059 0.363015
chargesum: 0.00000
title: Mulliken charges with hydrogens summed into heavy atoms:
elementType: S O O N N N C C C C C C C C C
charge: 0.306153 -0.203517 -0.243065 -0.021318 0.085786 -0.057426 0.025103 0.032857 0.078908 0.035639 -0.116684 -0.054148 -0.345581 0.243486 0.233807
polarizability: 2.19738019e+02 -1.89954165e+01 1.49361030e+02 2.88320274e-02 -5.90422684e-02 8.29244901e+01
1716.lowfreq: -29.2811 -6.1915 -3.6514 -0.0021 -0.0019 -0.0010 14.9396 22.7069 35.2422
frequency: -16.8117 20.9050 35.2290 56.5479 90.4369 95.2081 106.9436 122.3148 138.0678 160.6736 165.9162 215.7282 236.4158 290.8053 312.6316 353.2781 378.6201 408.1118 433.3399 440.0663 509.4036 569.3209 631.9781 656.9933 679.1233 694.8745 704.8028 723.7929 726.9445 739.4577 775.8149 784.4800 869.5912 890.8879 960.3595 972.6485 1005.6498 1029.7246 1052.6363 1065.8980 1075.1163 1078.9675 1108.5506 1117.2516 1190.5326 1218.5836 1227.0211 1237.4467 1267.9220 1278.0640 1287.4827 1296.3051 1314.8911 1337.7389 1347.4346 1352.6563 1359.9857 1390.7954 1410.3067 1439.7511 1462.9834 1464.0740 1472.8453 1478.5919 1481.5026 1488.1984 1501.3698 1630.8098 1680.9720 2955.1194 2959.6895 2968.2929 2973.3952 2980.7431 2991.8415 3007.6369 3028.3788 3028.5814 3045.7690 3070.0035 3073.0428 3105.3996 3520.1154 3582.6871
redmass: 1.6697 5.1374 5.3492 4.0387 1.8512 5.4811 4.2602 3.2564 1.9897 8.0839 6.4149 4.5503 1.1011 4.8231 9.8394 8.3960 7.5782 6.9848 3.8174 4.1177 8.7629 7.2586 8.1135 1.2390 2.6873 6.2382 13.3878 1.0668 2.8686 1.0931 2.6347 1.1644 1.2173 1.8993 4.0201 1.1851 3.9117 3.8737 5.6576 2.8276 1.1288 2.2706 6.9179 2.5994 1.6759 4.7479 1.3879 1.3425 1.2670 1.1541 1.0665 1.0979 1.3451 4.7802 1.4683 1.6309 1.9461 1.2147 1.5983 1.0875 1.0656 1.0773 1.0743 1.0424 1.0796 1.0864 4.4043 8.2441 5.7154 1.0587 1.0588 1.0591 1.0362 1.0589 1.0980 1.1014 1.0882 1.0717 1.1047 1.1007 1.0993 1.1083 1.0773 1.0796
irintensity: 0.0036 0.5205 0.0923 0.0479 0.2195 0.0212 0.1744 0.7509 0.2617 4.7991 2.7626 0.7132 0.0024 5.1912 1.3975 14.0387 8.1339 0.9457 2.0746 1.4869 21.6035 2.0499 44.8342 78.9993 0.2113 6.5589 26.5548 15.7664 67.6850 0.2131 134.0471 5.7261 0.1192 2.7440 43.1706 1.1557 0.4142 10.1813 11.4068 0.6827 0.1734 1.8287 121.7137 10.8625 0.3687 38.2092 6.9923 0.0771 7.9429 0.0452 0.3044 0.3715 8.4791 114.0727 8.2692 0.9027 18.4210 11.3704 21.8476 5.9921 0.9116 0.1911 1.6235 12.7827 3.6077 21.7343 63.0226 248.6619 711.1318 0.2637 3.9097 76.3871 37.4406 46.0296 0.2146 0.0106 13.3041 13.5301 72.3736 88.8538 51.5626 22.4276 70.8943 79.7928
temp: 298.150 k
press: 1.00000 atm
elementType: 16 8 8 7 7 7 6 6 6 6 6 6 6 6 6 1 1 1 1 1 1 1 1 1 1 1 1 1 1 1
symmnumber: 1
zpe: 630398.9 jmol-1
zpe.correction: 0.240106 hartree
zpe.thermalcorrener: 0.255899 hartree
zpe.thermalcorrenthalpy: 0.256843 hartree
zpe.thermalcorrgfe: 0.194562 hartree
zpe.sumelectzpe: -1063.563804 hartree
zpe.sumelectthermal: -1063.548011 hartree
zpe.sumelectthermalent: -1063.547067 hartree
zpe.sumelectthermalfe: -1063.609349 hartree
dipole: -3.6471 -2.2533 0.0006
dipole: 4.2871
quadrupole: -106.9411 -106.3766 -96.8435
quadrupole: 2.2549 0.0070 -0.0118
quadrupole: -3.5540 -2.9895 6.5436 2.2549 0.0070 -0.0118
hfenergy: -1063.8039104 hartree
pointgroup: C01 [X(C9H15N3O2S1)]
dipole: -1.4289129 0.8961041 0.0047678 debye
polarizability: 219.9891067|18.5192992|149.1049624|0.3975922|0.550759|82.9294695 unknown
InChI: InChI=1S/C9H15N3O2S/c1-2-3-4-5-6-15-8-7(13)10-9(14)12-11-8/h10,12H,2-6H2,1H3
charge 0 multiplicity 1
30 atoms
S  0.240588 -1.429202 -0.010286
O  3.094758 -2.469086 -0.004995
O  5.241307 1.712381 0.021554
N  4.16439 -0.387295 0.009123
N  1.68818 0.895381 0.008999
N  2.89917 1.578219 0.01618
C  -3.570777 0.402814 0.014129
C  -4.991587 -0.204659 -0.027873
C  -2.459674 -0.674605 -0.023554
C  -6.109794 0.861081 0.023555
C  -1.060486 -0.040779 0.002954
C  -7.526002 0.247838 -0.02208
C  1.744365 -0.431457 0.001467
C  3.016806 -1.213343 0.001382
C  4.188877 1.026162 0.016885
H  -3.460918 1.014712 0.933381
H  -3.443872 1.096737 -0.842609
H  -5.116801 -0.907051 0.822441
H  -5.105907 -0.809813 -0.951239
H  -2.581885 -1.356114 0.841616
H  -2.576532 -1.290967 -0.936777
H  -5.983249 1.564576 -0.824765
H  -5.996627 1.464448 0.947388
H  -0.870966 0.59502 -0.877714
H  -0.889036 0.559337 0.912075
H  -7.691879 -0.432452 0.834463
H  -7.67481 -0.338109 -0.948669
H  -8.306678 1.029693 0.011843
H  5.077205 -0.855236 0.0091
H  2.820336 2.595269 0.020826
