program: Gaussian 09
title: 000267905
version: EM64L-G09RevD.01
frameworkgroup: C1[X(C4H4N6O2)]
method: RPBEPBE
basis: SDD
operation: Freq
keyword: #pfreq=noraman
keyword: PBEPBE/SDD
title: #p freq=noraman PBEPBE/SDD
converged: NO NO NO NO
title: Mulliken charges:
elementType: O O N N N N N N C C C C H H H H
charge: -0.120824 -0.221315 -0.028436 -0.024163 -0.109084 -0.020519 -0.620484 -0.579020 0.104885 0.003057 0.219161 0.016046 0.356328 0.344316 0.337881 0.342173
chargesum: 0.00000
title: Mulliken charges with hydrogens summed into heavy atoms:
elementType: O O N N N N N N C C C C
charge: -0.120824 -0.221315 -0.028436 -0.024163 -0.109084 -0.020519 0.080159 0.101034 0.104885 0.003057 0.219161 0.016046
polarizability: 1.54526720e+02 6.17002241e+00 1.16632991e+02 -5.62808265e-03 2.24328614e-03 3.70638325e+01
1716.lowfreq: -8.5430 -5.5629 -3.2730 -0.0006 -0.0003 0.0003 94.0933 168.9377 206.9547
frequency: 94.0925 168.9364 206.9546 214.0417 247.1917 311.4379 329.3882 376.6557 408.2202 456.2882 493.0613 494.9731 543.3433 551.4334 561.8201 576.1684 603.3549 641.4719 644.4670 703.2728 739.7010 761.1008 765.5273 890.6744 966.0390 1030.9891 1137.5520 1174.8049 1224.6822 1334.1534 1369.2571 1415.2163 1487.7099 1531.9975 1565.9234 1595.6528 1616.8491 1639.6818 3511.8687 3557.5377 3668.5251 3716.5300
redmass: 7.0423 7.7358 6.6962 6.1782 9.8426 3.2634 8.5569 13.2960 5.7953 6.9593 7.4586 1.1674 6.3571 1.1537 1.1981 1.1800 6.9548 8.0909 5.4864 10.7630 9.4675 10.7510 11.9919 3.5030 6.5092 2.9475 2.1029 4.8597 7.8587 7.3418 5.4357 7.9113 4.5578 2.9426 3.3074 3.7748 2.2660 1.7956 1.0465 1.0445 1.1047 1.1060
irintensity: 0.2380 1.5791 6.4838 4.2315 4.4492 6.4174 2.7791 0.0415 2.6162 0.2716 0.4510 206.5142 3.6518 127.2941 12.0197 238.5983 0.8985 4.6635 41.4372 6.8925 4.2356 1.3917 29.2653 31.6916 49.7643 11.6066 0.5390 5.5087 20.9142 8.5724 149.6081 97.0814 52.0837 232.1398 122.1174 1095.3765 45.5799 306.4459 95.9037 162.3746 61.3230 56.7126
temp: 298.150 k
press: 1.00000 atm
elementType: 8 8 7 7 7 7 7 7 6 6 6 6 1 1 1 1
symmnumber: 1
zpe: 271124.9 jmol-1
zpe.correction: 0.103266 hartree
zpe.thermalcorrener: 0.112969 hartree
zpe.thermalcorrenthalpy: 0.113914 hartree
zpe.thermalcorrgfe: 0.068678 hartree
zpe.sumelectzpe: -632.820470 hartree
zpe.sumelectthermal: -632.810767 hartree
zpe.sumelectthermalent: -632.809822 hartree
zpe.sumelectthermalfe: -632.855058 hartree
dipole: -4.0791 5.1684 0.0087
dipole: 6.5842
quadrupole: -62.8631 -66.4458 -69.2595
quadrupole: 3.9362 -0.0436 -0.0042
quadrupole: 3.3264 -0.2563 -3.0700 3.9362 -0.0436 -0.0042
hfenergy: -632.9237361 hartree
pointgroup: C01 [X(C4H4N6O2)]
dipole: -1.6394508 2.0056245 0.0021678 debye
dipolederiv: -0.4571862 0.6633045 -0.0003905 -0.1037805 -0.0110622 0.000062 0.0004463 -0.0004542 -0.0858036 -0.998889 -0.3959206 -0.0006234 -0.6955459 -0.7680641 -0.0005253 -0.0001273 -0.0000755 -0.1652347 1.4135645 0.19088 0.0011187 0.5738307 0.7873791 0.000599 0.0003701 0.0002465 0.0736795 -1.3795994 0.1486113 -0.0001399 0.3650151 -0.6169658 -0.0007358 -0.000453 0.0005623 -0.2603345 -1.0901557 -0.5844629 -0.0001239 -0.335592 -0.8840281 0.0006522 0.000148 -0.0009423 -0.2666534 -0.18121 -0.5315798 -0.0002245 0.3240434 -0.2814426 0.0001867 -0.0012052 0.0005069 -0.1746085 -0.373235 -0.3881316 0.0004067 -0.3368893 -1.2508484 -0.0000882 0.0000298 -0.0003398 -0.6873058 -1.7097823 -0.0309886 -0.0010362 -0.184911 -0.2163147 -0.0003598 0.0018697 -0.0006742 -0.7005205 -0.8910482 0.1504904 -0.0008133 0.0463435 -0.4221462 0.0000076 -0.0008382 0.0000968 0.1080415 1.3560923 0.1304044 0.0012742 0.0990882 0.0978074 0.0000009 0.0017099 0.0000242 0.1441201 1.1642948 0.5092305 0.0005956 0.0803972 1.5069846 -0.0002281 0.0006655 -0.000291 0.2587449 2.2172363 0.0953915 -0.0009701 0.054521 1.1000349 -0.0000011 -0.0042253 0.0007494 0.1975443 0.1899902 0.0365229 -0.0001782 0.0695029 0.2974762 0.0000781 -0.0001827 0.0002709 0.3851263 0.1600584 -0.0249112 -0.0001478 0.0128662 0.2991964 0.0000303 -0.000152 -0.0000769 0.3869464 0.3092424 -0.0088424 0.0006371 -0.0851288 0.1802312 0.0001978 0.00111 0.0002114 0.3909542 0.270627 0.0400017 0.0006152 0.1162394 0.1817621 0.0001236 0.0008344 0.0001855 0.3953038 unknown
polarizability: 154.304145|6.8156778|116.8555478|0.0392167|-0.0195612|37.0638512 unknown
InChI: InChI=1S/C4H4N6O2/c5-2-1-3(8-4(6)7-2)9-12-10(1)11/h5-6H2
charge 0 multiplicity 1
16 atoms
O  2.241299 -1.426305 0.000393
O  2.881705 1.023383 0.001187
N  1.936606 0.173155 0.000691
N  -1.328412 -1.338259 -0.00179
N  -1.631353 1.130531 -0.002723
N  0.998263 -2.081248 0.000887
N  0.20146 2.620721 -0.001247
N  -3.439356 -0.337809 0.000221
C  0.594145 0.213068 -0.000519
C  0.024522 -1.120142 -0.000004
C  -0.306903 1.351085 -0.001404
C  -2.075399 -0.205437 -0.004143
H  1.210451 2.776187 -0.00064
H  -0.443705 3.408843 -0.001861
H  -4.020681 0.495762 0.00195
H  -3.843542 -1.271036 0.002604
