program: Gaussian 09
title: 000267901
version: EM64L-G09RevD.01
frameworkgroup: C1[X(C6H10N6)]
method: RPBEPBE
basis: SDD
operation: Freq
keyword: #pfreq=noraman
keyword: PBEPBE/SDD
title: #p freq=noraman PBEPBE/SDD
converged: YES YES NO NO
title: Mulliken charges:
elementType: N N N N N N C C C C C C H H H H H H H H H H
charge: -0.212898 -0.082175 -0.655991 -0.615322 -0.115774 -0.031105 0.034416 0.239377 -0.394854 0.138343 -0.683469 -0.376265 0.210316 0.211646 0.208081 0.224281 0.224406 0.335318 0.359112 0.316841 0.408626 0.257092
chargesum: 0.00000
title: Mulliken charges with hydrogens summed into heavy atoms:
elementType: N N N N N N C C C C C C
charge: -0.212898 -0.082175 0.038439 0.110145 -0.115774 -0.031105 0.034416 0.239377 0.027108 0.138343 -0.026702 -0.119173
polarizability: 1.67160115e+02 7.29654437e+00 1.20185560e+02 1.09197846e-01 5.20298985e-02 5.52331801e+01
1716.lowfreq: -0.0007 -0.0004 -0.0004 1.7856 4.8084 7.8076 48.0263 92.4945 108.0118
frequency: 48.0107 92.4925 108.0106 113.7542 168.3548 241.9232 267.0523 301.8316 320.0976 340.7376 396.9220 403.6024 462.2317 506.2672 548.3589 590.5570 602.2413 628.5416 674.2811 683.3956 746.2207 796.1642 797.0115 862.8232 867.5960 889.5095 900.4872 999.8620 1028.3270 1079.1089 1101.9228 1105.5248 1115.7358 1140.7839 1153.5121 1229.3461 1269.8823 1343.7055 1363.1280 1391.7724 1393.6353 1410.8883 1453.6817 1468.8784 1469.1691 1475.0532 1483.5502 1563.2296 1583.1236 1613.9119 2895.7702 2939.8710 2989.6578 3082.6445 3090.4328 3093.2852 3188.9784 3490.0570 3593.6749 3682.9137
redmass: 3.0082 3.8873 4.0885 3.7604 2.5455 1.5973 3.6134 2.7079 3.7414 3.8668 3.4816 1.8100 1.8592 4.3292 3.3752 7.4021 1.5623 6.7059 1.0895 6.1231 3.8890 1.2502 4.5459 1.3767 4.3772 3.4540 1.1097 3.3955 2.4879 7.6822 2.1882 1.5012 3.0699 5.4848 2.3187 2.3298 1.1334 1.4582 1.8451 2.5445 1.4657 3.1413 1.1664 4.3033 1.0451 1.5234 1.1274 1.5601 2.8052 3.8254 1.0559 1.1020 1.0355 1.0738 1.0944 1.1008 1.0929 1.0500 1.0854 1.0982
irintensity: 0.6591 0.2221 0.0159 2.3861 9.1530 7.7270 18.2451 0.7147 4.5934 3.8462 1.7284 76.0310 43.6922 39.0937 28.0508 2.9023 161.0989 8.7748 118.0303 8.7625 0.2425 12.4293 0.5188 18.0988 2.1337 2.7083 98.3474 7.7716 4.9440 30.0720 21.4891 6.3099 32.8554 65.0741 34.7692 0.8794 0.0695 60.8966 26.1303 27.8702 45.5808 27.2115 8.2788 13.0844 12.3774 18.7124 17.7527 136.4495 96.7335 397.9666 56.4465 42.9275 34.4461 357.2986 4.3049 37.5369 10.4046 70.7561 72.8785 52.9431
temp: 298.150 k
press: 1.00000 atm
elementType: 7 7 7 7 7 7 6 6 6 6 6 6 1 1 1 1 1 1 1 1 1 1
symmnumber: 1
zpe: 452448.6 jmol-1
zpe.correction: 0.172329 hartree
zpe.thermalcorrener: 0.183734 hartree
zpe.thermalcorrenthalpy: 0.184678 hartree
zpe.thermalcorrgfe: 0.134895 hartree
zpe.sumelectzpe: -562.222794 hartree
zpe.sumelectthermal: -562.211389 hartree
zpe.sumelectthermalent: -562.210445 hartree
zpe.sumelectthermalfe: -562.260228 hartree
dipole: -5.3619 2.5350 -0.0052
dipole: 5.9309
quadrupole: -77.8730 -62.3441 -73.1853
quadrupole: 3.7315 0.0181 -0.0007
quadrupole: -6.7389 8.7901 -2.0512 3.7315 0.0181 -0.0007
hfenergy: -562.3951226 hartree
pointgroup: C01 [X(C6H10N6)]
dipole: 2.1360097 0.9383847 -0.0407746 debye
dipolederiv: -0.8405512 0.2411709 -0.0219395 0.1763583 -0.6560749 0.0241044 -0.0167435 0.0237286 -0.3589193 0.0412175 0.0712023 -0.0019031 -0.1124946 -0.3566387 0.0092942 0.0112819 0.0115186 -0.210386 -0.4212351 -0.2405121 0.0213962 0.0575305 -1.1645539 0.0387959 -0.0006233 0.0356407 -0.6382179 -0.6897161 0.4703425 -0.0352796 0.3675918 -0.8525972 0.0232317 -0.0278405 0.024564 -0.6017423 0.0836848 0.7371261 -0.0489804 -0.3174238 -0.1908062 -0.0111146 0.0277586 0.0020521 -0.288088 -0.2945358 -0.277156 0.019051 0.6574286 0.220402 -0.0230041 -0.0490291 -0.0346649 -0.2058009 0.199216 -0.2780707 0.0217779 0.5834962 -0.188521 0.026448 -0.0406886 0.015495 0.074075 0.4976049 0.1591757 -0.0067147 -0.0386928 1.2751791 -0.0855356 0.0077164 -0.0831796 0.1033153 0.6026629 -0.1007777 0.0096988 -0.1837657 0.1620984 0.0101769 0.0125217 0.0122336 0.3563147 0.081804 -0.8454515 0.0583043 -0.8118265 0.6424947 -0.0324564 0.0558762 -0.0327955 0.3383416 -0.0073262 0.0749893 -0.0056395 0.0554856 -0.0045625 0.0039985 -0.0034676 0.0043788 0.055757 -0.1065632 -0.190728 0.0123021 -0.5875807 0.0090461 -0.0062533 0.0409964 -0.0010043 0.0254509 -0.1320247 0.0175597 0.0024326 -0.0564495 -0.0235875 0.1277802 0.090687 0.1117746 -0.0997353 -0.130021 0.0194083 -0.0070398 -0.0647203 -0.0535047 -0.1343253 -0.0822049 -0.117547 -0.0698351 -0.2169191 -0.0261656 -0.0015482 -0.0806755 0.0614292 0.0023848 0.0019144 0.0030039 0.1096268 0.1153099 -0.0400971 0.0617085 0.0218901 0.0116842 0.0966523 0.0185122 0.1075218 -0.0827902 0.116736 -0.0453166 -0.0524737 0.0215864 -0.0156139 -0.1048294 -0.0178053 -0.1169225 -0.0567746 0.1179756 0.0077597 -0.0040246 -0.0036103 0.2600398 0.0069985 -0.0031148 0.007406 0.354899 0.3253676 0.0661243 -0.0055559 0.0330882 0.2814396 0.0060017 -0.0031222 0.0064381 0.3603206 0.1352542 -0.072559 0.0025854 -0.0363136 0.2280313 0.0087689 -0.0000919 0.0082104 0.3548696 0.5113576 0.1904971 -0.0118269 0.2274768 0.3498138 0.0006221 -0.0141245 0.000416 0.3230288 0.0107015 0.0614786 -0.006331 0.091621 0.0048021 0.0122607 -0.0084086 0.0117316 0.1562903 unknown
polarizability: 166.7060876|-8.4562091|120.2667562|1.9882128|-4.812674|55.606011 unknown
InChI: InChI=1S/C6H10N6/c1-2-9-5(7)4-6(8)12-11-3-10-4/h3H,2,7-8H2,1H3
charge 0 multiplicity 1
22 atoms
N  1.819074 -0.17417 -0.019454
N  -1.474269 1.355542 -0.172036
N  1.086855 2.132341 -0.195717
N  -0.088781 -2.036075 0.091896
N  -2.338821 -1.326555 0.012177
N  -3.24649 -0.310451 -0.073332
C  -0.546261 0.365249 -0.088481
C  0.886143 0.768976 -0.099518
C  3.240068 0.23675 -0.032389
C  -0.975868 -1.013035 0.006405
C  4.154011 -0.995299 0.054522
C  -2.785361 0.981208 -0.161721
H  3.472845 0.807411 -0.9619
H  3.456096 0.920511 0.821563
H  5.219131 -0.700733 0.045362
H  3.955613 -1.557083 0.984232
H  3.971606 -1.670982 -0.799522
H  2.014632 2.543931 -0.211817
H  0.248144 2.71616 -0.249534
H  -0.444184 -2.989839 0.156615
H  0.917562 -1.743763 0.082867
H  -3.550145 1.757306 -0.227717
