program: Gaussian 09
title: 000267923
version: EM64L-G09RevD.01
frameworkgroup: C1[X(C16H12BrN3O2)]
method: RPBEPBE
basis: SDD
operation: Freq
keyword: #p
keyword: freq=noraman
keyword: PBEPBE/SDD
title: #p freq=noraman PBEPBE/SDD
converged: YES YES NO NO
title: Mulliken charges:
elementType: Br O O N N N C C C C C C C C C C C C C C C C H H H H H H H H H H H H
charge: 0.108051 -0.180735 -0.253625 -0.263644 -0.439588 0.130174 -0.325160 0.452528 0.447373 -0.420184 -0.360229 -0.332051 -0.398683 0.405563 0.289784 -0.234687 -0.244553 -0.263879 -0.238411 -0.236591 -0.245626 -0.440548 0.275046 0.251545 0.223397 0.291152 0.255092 0.229459 0.226966 0.231733 0.227176 0.231459 0.230528 0.371169
chargesum: 0.00000
title: Mulliken charges with hydrogens summed into heavy atoms:
elementType: Br O O N N N C C C C C C C C C C C C C C C C
charge: 0.108051 -0.180735 -0.253625 -0.263644 -0.068420 0.130174 -0.050114 0.452528 0.447373 -0.168639 -0.136832 -0.040899 -0.143592 0.405563 0.289784 -0.005227 -0.017587 -0.032146 -0.011235 -0.005132 -0.015098 -0.440548
polarizability: 2.12253001e+02 1.80184916e+01 2.09596178e+02 4.07490903e+00 -1.39144392e+01 1.99917787e+02
1716.lowfreq: -3.1655 -0.0002 0.0001 0.0006 1.6683 3.7797 19.7015 37.4684 46.1611
frequency: 19.5932 37.4465 46.1584 48.9284 71.8540 83.0879 96.0771 128.8571 151.6765 217.7891 229.9264 234.6516 249.4464 273.7494 288.2091 299.6306 338.0242 403.9440 408.4978 412.3033 455.9046 463.7639 486.1279 544.9555 567.0591 605.2961 614.7834 617.2067 624.0820 652.0054 671.7652 700.6992 702.8088 707.0779 712.7585 739.6435 745.8783 768.8884 823.6436 852.8727 863.1408 868.3351 876.3186 927.0772 942.6327 979.4448 987.6789 991.0943 991.3672 996.3696 1003.4250 1028.4075 1031.1357 1053.4864 1081.6496 1087.6945 1095.6442 1115.6826 1169.9412 1174.2962 1174.4479 1183.5981 1195.3905 1196.7221 1227.7124 1275.6156 1303.5707 1324.3540 1344.5514 1363.0653 1381.1587 1389.8410 1419.8966 1437.9545 1446.6851 1483.2421 1485.9186 1524.0458 1590.0578 1594.2261 1606.4794 1611.6884 1615.8323 1653.7397 3010.8977 3120.7810 3121.5991 3129.3459 3130.1020 3142.1851 3144.0858 3153.9023 3160.3849 3166.7954 3175.7087 3574.0407
redmass: 7.0694 4.6730 6.3152 5.6558 6.2674 4.4078 12.4288 9.4436 6.7552 4.9206 9.0726 6.2153 6.0829 19.0776 7.3018 5.4253 9.4800 2.8219 4.8095 4.0862 4.2661 7.9565 4.9405 6.2554 7.9721 6.3692 5.8724 6.3351 6.5954 5.6714 1.5555 2.4264 5.2062 2.1262 2.6758 1.8752 7.9132 2.0059 3.5356 1.2681 1.2994 4.6313 3.8762 1.4921 1.4931 1.3853 1.4013 5.8748 5.7183 1.3128 1.3267 2.3946 2.1732 5.2923 2.6696 1.7804 2.6153 8.4548 3.9766 1.0793 1.1261 2.8918 1.1362 1.1179 2.2670 1.6622 8.9297 1.3426 1.3054 1.7030 7.8853 3.1516 1.5419 2.2483 2.0825 2.2062 2.2608 6.0954 5.8508 6.3455 9.2785 5.9432 6.0609 7.2914 1.0817 1.0857 1.0867 1.0869 1.0883 1.0924 1.0934 1.0952 1.0985 1.1012 1.0968 1.0797
irintensity: 0.0161 0.2221 0.3019 0.4456 0.5912 0.1194 1.7563 4.1172 0.3319 0.1282 1.6492 1.4818 3.6276 0.2220 1.3323 0.8816 0.2641 0.0025 6.6673 6.3310 4.3645 1.1182 1.4964 35.8715 8.1988 10.7232 38.1189 1.0413 61.4352 6.0802 57.6553 55.9057 13.3003 35.2146 92.0814 29.0644 25.4041 21.8921 36.7723 0.1229 0.1744 8.1837 11.0345 4.8399 2.4595 0.0652 1.0406 1.1609 0.2880 0.3064 0.6040 3.9718 12.7040 32.1789 24.9926 16.9137 16.4761 72.8255 65.4807 0.9313 2.7655 4.9174 5.2822 2.8000 11.9479 8.4036 167.6246 3.6272 9.5222 17.3711 0.6052 6.6992 2.8095 10.2645 12.9633 7.7528 28.2574 34.0319 17.4136 8.6473 296.9108 9.1217 15.1063 247.1939 11.8857 7.9775 1.6871 0.6155 2.5938 22.8674 25.3192 35.6558 24.6785 19.0071 5.9960 111.6019
temp: 298.150 k
press: 1.00000 atm
elementType: 35 8 8 7 7 7 6 6 6 6 6 6 6 6 6 6 6 6 6 6 6 6 1 1 1 1 1 1 1 1 1 1 1 1
symmnumber: 1
zpe: 653289.7 jmol-1
zpe.correction: 0.248825 hartree
zpe.thermalcorrener: 0.267140 hartree
zpe.thermalcorrenthalpy: 0.268084 hartree
zpe.thermalcorrgfe: 0.199698 hartree
zpe.sumelectzpe: -943.525274 hartree
zpe.sumelectthermal: -943.506958 hartree
zpe.sumelectthermalent: -943.506014 hartree
zpe.sumelectthermalfe: -943.574401 hartree
dipole: -0.5933 -0.5709 0.9287
dipole: 1.2412
quadrupole: -132.2663 -123.5796 -135.6944
quadrupole: 1.8507 10.7046 1.3051
quadrupole: -1.7529 6.9338 -5.1809 1.8507 10.7046 1.3051
hfenergy: -943.7740985 hartree
pointgroup: C01 [X(C16H12Br1N3O2)]
dipole: -0.2166161 -0.1913377 0.3935868 debye
polarizability: 220.4848896|12.5561359|203.6946796|-2.1160177|-16.562372|197.5873963 unknown
InChI: InChI=1S/C16H12BrN3O2/c17-14-15(21)20(16(22)19-18-14)13(11-7-3-1-4-8-11)12-9-5-2-6-10-12/h1-10,13,19H
charge 0 multiplicity 1
34 atoms
Br 4.042054 -0.906293 -2.149549
O  1.125452 0.180442 -1.636105
O  0.733343 -1.275458 2.843104
N  0.882858 -0.472785 0.6133
N  2.665556 -1.674924 1.613808
N  3.460022 -1.617163 0.490858
C  -0.529795 0.075781 0.711892
C  -1.509289 -0.856661 -0.011477
C  -0.590972 1.571726 0.372772
C  -2.190269 -1.836225 0.75602
C  0.501522 2.424228 0.670304
C  -1.740574 -0.792567 -1.410574
C  -1.794591 2.150219 -0.098703
C  1.600007 -0.376054 -0.618042
C  1.3704 -1.146024 1.765888
C  -3.085242 -2.740205 0.141366
C  0.405131 3.817701 0.473791
C  -2.634485 -1.696809 -2.023314
C  -1.894323 3.546275 -0.29184
C  -3.309766 -2.672458 -1.252626
C  -0.794456 4.386907 -0.011755
C  2.955234 -1.001478 -0.554706
H  -0.742645 -0.014826 1.794194
H  -2.013704 -1.892169 1.837327
H  1.43688 2.003651 1.058288
H  -1.210572 -0.047044 -2.009831
H  -2.65759 1.512414 -0.314325
H  -3.605788 -3.48962 0.747715
H  1.26462 4.458495 0.700173
H  -2.802572 -1.640693 -3.104535
H  -2.83268 3.974998 -0.661188
H  -4.003772 -3.371123 -1.733365
H  -0.870445 5.468876 -0.165934
H  3.068352 -2.165937 2.413171
