program: Gaussian 09
title: 000267972
version: EM64L-G09RevD.01
frameworkgroup: C1[X(C19H29N3O2)]
method: RPBEPBE
basis: SDD
operation: Freq
keyword: #p
keyword: freq=noraman
keyword: PBEPBE/SDD
title: #p freq=noraman PBEPBE/SDD
converged: YES YES NO NO
title: Mulliken charges:
elementType: O O N N N C C C C C C C C C C C C C C C C C C C H H H H H H H H H H H H H H H H H H H H H H H H H H H H H
charge: -0.210558 -0.223817 -0.216073 -0.015947 0.017740 -0.385813 -0.387431 -0.387562 -0.385001 -0.379206 -0.370205 -0.386862 -0.382173 -0.393937 -0.354333 -0.354545 0.394390 0.188698 -0.701952 -0.489220 -0.437609 -0.331142 0.440412 -0.394506 0.196188 0.189537 0.195365 0.192647 0.196120 0.189613 0.195454 0.193266 0.202621 0.212868 0.185693 0.185006 0.196331 0.244867 0.186767 0.213613 0.215073 0.244259 0.180792 0.189728 0.214683 0.186154 0.215701 0.212271 0.203187 0.291970 0.276730 0.254128 0.286021
chargesum: 0.00000
title: Mulliken charges with hydrogens summed into heavy atoms:
elementType: O O N N N C C C C C C C C C C C C C C C C C C C
charge: -0.210558 -0.223817 -0.216073 -0.015947 0.017740 -0.000088 0.000581 -0.001829 0.003718 0.036284 0.000494 0.054336 0.018207 0.065395 0.016187 0.046292 0.394390 0.188698 -0.070793 -0.197250 -0.160879 -0.077014 0.440412 -0.108485
polarizability: 3.18301531e+02 2.02342999e+01 2.14962969e+02 -1.41091859e+01 3.17233509e+01 1.85097242e+02
1716.lowfreq: -14.1337 -12.3207 -6.1932 -0.0003 0.0005 0.0007 4.7480 11.0757 18.0546
frequency: -12.6858 -3.7771 16.9380 28.9992 36.0768 59.7551 65.1663 73.3141 79.2444 86.0634 110.2655 120.3818 124.3930 147.0848 158.4212 167.6635 182.5481 194.5266 225.6173 232.2789 257.9930 266.4378 283.0632 304.9304 319.7209 341.8066 354.5471 396.4066 424.8864 454.4461 458.3396 469.8106 482.5956 533.3834 563.5827 575.7518 617.1299 635.1140 699.9748 703.4972 715.8704 725.2893 733.2167 754.7710 755.6925 763.2207 794.0059 802.5422 815.0003 818.7470 828.3457 854.0244 872.8156 885.8150 903.3718 904.4492 913.8357 920.7391 947.1706 983.4586 983.9867 989.1198 998.5721 1025.9051 1031.5006 1042.4799 1058.4959 1070.2301 1076.5906 1081.0715 1094.8312 1110.0500 1115.7906 1123.3731 1127.4918 1153.1969 1160.4346 1187.7276 1192.5702 1208.8951 1210.8775 1228.7402 1235.2115 1246.8486 1263.8274 1265.5722 1270.6542 1281.9569 1286.9438 1290.1633 1293.9037 1295.2024 1299.1260 1304.9976 1318.2304 1326.6169 1339.6806 1345.3940 1347.8686 1354.4570 1355.8885 1357.0302 1359.7013 1361.7986 1382.5650 1400.5191 1422.6128 1457.3224 1459.1501 1460.8148 1462.9074 1463.0905 1464.7553 1467.7505 1470.0157 1474.9748 1476.2330 1476.5076 1478.9602 1482.8250 1483.5643 1489.0058 1579.2564 1621.3677 2944.5833 2949.1257 2951.9825 2955.9281 2957.3800 2961.6938 2967.1188 2968.4285 2968.8042 2974.6793 2982.2923 2985.2931 2991.0029 3000.6986 3002.7687 3013.6886 3015.7617 3019.5948 3029.7867 3035.9626 3040.7178 3053.0428 3064.9475 3068.9070 3078.7006 3157.3330 3181.2856 3191.9913 3228.1058
redmass: 3.6351 4.9693 2.6930 4.0276 2.8381 4.4742 4.2826 3.2060 4.1847 2.1643 5.0820 4.4590 2.1034 2.3115 2.1127 2.9644 3.1618 3.2223 2.9025 1.1159 4.7626 3.9816 2.6353 3.7365 2.6562 9.1702 2.5770 2.5428 2.9234 2.6174 3.1728 3.6116 2.6393 4.8738 5.3324 4.6852 6.2288 4.5534 2.6024 5.4266 1.3972 1.0860 1.2754 3.0745 1.3475 4.4758 1.6040 2.9222 1.8509 1.2952 1.8162 1.6139 2.0440 1.8873 1.8890 1.5174 1.6385 5.1788 1.9307 1.3289 2.4654 1.3504 3.2160 1.7378 2.2687 1.9546 2.1335 2.4719 2.2344 2.0789 1.9134 2.1436 2.1416 2.2299 1.8419 2.1208 1.4056 1.7159 1.5701 4.7578 1.5686 1.3525 1.3908 1.3540 1.5343 1.4956 1.2830 1.0806 1.7123 1.3023 1.1420 1.4385 1.1956 1.2250 1.3006 3.1359 1.4219 1.4619 1.4342 1.6833 1.6401 1.4111 1.4611 6.7643 1.2215 3.2727 3.7877 1.0724 1.0983 1.0809 1.0785 1.0740 1.1190 1.0990 1.0809 1.0922 3.8522 1.1107 1.0994 4.2959 1.1120 1.1004 8.0545 7.9834 1.0592 1.0588 1.0595 1.0588 1.0610 1.0607 1.0517 1.0578 1.0502 1.0604 1.0953 1.0645 1.0957 1.1001 1.0967 1.0694 1.0940 1.1011 1.1037 1.1020 1.1035 1.1005 1.1001 1.1001 1.1019 1.0906 1.0924 1.0952 1.0979
irintensity: 0.1309 0.1555 0.0356 0.1202 0.1614 0.0406 0.5703 0.2161 0.8059 0.0416 3.5554 0.8648 0.3221 0.0382 0.0800 0.6900 0.4315 0.9809 0.0583 0.0062 0.2864 1.6898 0.9826 1.5706 0.5658 0.2984 0.2226 5.7403 6.7877 1.4910 0.5851 2.2212 0.1318 3.3340 1.7367 2.1745 10.0893 3.8383 7.4278 28.7513 3.3781 17.3392 6.3516 2.5268 8.1079 27.2312 2.1398 7.5763 0.3927 0.1080 1.4945 50.3072 1.6378 6.1394 1.8523 41.3259 3.7752 11.1773 2.0738 0.8240 4.5575 0.4046 0.5905 4.7866 3.9567 3.7543 17.4687 0.5872 5.9415 0.7669 18.1118 2.7149 1.1673 3.2366 2.4284 19.9104 1.3832 0.9307 20.5302 305.2497 52.1292 20.0376 14.5923 12.1776 7.9861 8.5864 2.2076 0.7848 1.7806 0.4628 2.3549 4.4546 2.1784 1.3534 0.5182 6.7737 2.6313 0.7207 0.9725 9.3916 15.8246 8.0643 0.8917 103.4364 10.5267 24.5841 32.2966 0.4538 13.9045 2.0196 5.3046 6.7903 5.4445 3.8768 2.3062 7.1462 4.7474 5.7952 13.6201 23.4142 5.0195 31.0323 0.5525 10.2341 1.8892 12.0207 1.1413 30.0530 3.3536 56.7839 79.5930 42.2308 37.5252 46.1657 3.2705 26.3165 6.8672 1.8507 12.5609 15.1508 40.7878 32.1150 18.4357 102.6336 242.1072 34.5665 84.5364 87.1218 19.1651 6.1281 1.5084 3.3888 1.2271
temp: 298.150 k
press: 1.00000 atm
elementType: 8 8 7 7 7 6 6 6 6 6 6 6 6 6 6 6 6 6 6 6 6 6 6 6 1 1 1 1 1 1 1 1 1 1 1 1 1 1 1 1 1 1 1 1 1 1 1 1 1 1 1 1 1
symmnumber: 1
zpe: 1185698.7 jmol-1
zpe.correction: 0.451609 hartree
zpe.thermalcorrener: 0.475153 hartree
zpe.thermalcorrenthalpy: 0.476098 hartree
zpe.thermalcorrgfe: 0.396887 hartree
zpe.sumelectzpe: -1054.193786 hartree
zpe.sumelectthermal: -1054.170242 hartree
zpe.sumelectthermalent: -1054.169297 hartree
zpe.sumelectthermalfe: -1054.248508 hartree
dipole: 4.2917 0.4688 -1.1455
dipole: 4.4666
quadrupole: -157.7076 -139.8090 -145.2822
quadrupole: -2.1261 7.6061 7.6282
quadrupole: -10.1080 7.7906 2.3174 -2.1261 7.6061 7.6282
hfenergy: -1054.6453951 hartree
pointgroup: C01 [X(C19H29N3O2)]
dipole: 1.6836452 -0.0582666 -0.5000669 debye
polarizability: 321.5709439|-6.645519|181.0401887|-7.0568318|32.3727873|215.7506085 unknown
InChI: InChI=1S/C19H29N3O2/c1-2-3-4-5-6-7-8-9-10-11-14-21-19-15-18(22(23)24)13-12-17(19)16-20-21/h12-13,15-16H,2-11,14H2,1H3
charge 0 multiplicity 1
53 atoms
O  -3.22528 -1.517728 -0.319945
O  -1.881792 -1.067833 1.466157
N  2.875534 -1.643688 -0.611167
N  3.611757 -1.994941 -1.741512
N  -2.060483 -1.398492 0.227357
C  2.416892 3.273442 0.902606
C  1.126715 3.177665 0.046608
C  3.06443 1.908987 1.257919
C  -0.123259 2.74216 0.847788
C  3.82073 1.266642 0.069015
C  -1.398969 2.636769 -0.018647
C  4.534942 -0.062797 0.408387
C  -2.667548 2.302162 0.798801
C  3.590754 -1.268245 0.6224
C  -3.930831 2.117763 -0.072723
C  -5.17519 1.704553 0.745954
C  1.506963 -1.714568 -0.853867
C  1.358396 -2.132452 -2.228049
C  -6.437678 1.530074 -0.125115
C  0.397798 -1.469021 -0.018713
C  2.701416 -2.286741 -2.710204
C  0.056908 -2.293865 -2.778673
C  -0.865712 -1.644482 -0.610739
C  -1.057999 -2.047144 -1.968702
H  2.175342 3.819338 1.837457
H  3.172129 3.887878 0.370165
H  0.920964 4.168141 -0.408318
H  1.283982 2.47968 -0.801436
H  3.782869 2.051885 2.091314
H  2.281564 1.221744 1.639658
H  -0.296987 3.47171 1.666556
H  0.056791 1.763968 1.340434
H  4.582652 1.988915 -0.287036
H  3.131623 1.106573 -0.783978
H  -1.248605 1.860331 -0.799087
H  -1.552316 3.593118 -0.562279
H  5.134491 0.060729 1.332653
H  5.237841 -0.331664 -0.40155
H  -2.846801 3.109363 1.540043
H  -2.495018 1.375476 1.383338
H  2.828383 -1.047163 1.388927
H  4.171402 -2.144288 0.964986
H  -4.144693 3.058678 -0.623204
H  -3.736304 1.340407 -0.840973
H  -4.954805 0.754135 1.271495
H  -5.365412 2.465066 1.531301
H  -6.278659 0.748882 -0.892319
H  -7.312204 1.23228 0.482759
H  -6.69401 2.470735 -0.649508
H  0.470568 -1.163347 1.027706
H  3.048347 -2.591665 -3.695469
H  -0.073497 -2.607667 -3.818853
H  -2.079133 -2.155459 -2.341215
