program: Gaussian 09
title: 000267985
version: EM64L-G09RevD.01
frameworkgroup: C1[X(C12H16Cl4O6P2)]
method: RPBEPBE
basis: SDD
operation: Freq
keyword: #p
keyword: freq=noraman
keyword: PBEPBE/SDD
title: #p freq=noraman PBEPBE/SDD
converged: YES YES NO NO
title: Mulliken charges:
elementType: Cl Cl Cl Cl P P O O O O O O C C C C C C C C C C C C H H H H H H H H H H H H H H H H
charge: 0.034933 0.046597 0.016797 0.035396 1.278257 1.275964 -0.490423 -0.523537 -0.687735 -0.659711 -0.593991 -0.608871 0.787104 0.776581 -0.948228 -0.934763 -0.328866 -0.361029 -0.338855 -0.343034 -0.230308 -0.235401 -0.650559 -0.650717 0.337014 0.295431 0.329839 0.316622 0.199791 0.237049 0.230559 0.216087 0.395774 0.396156 0.213776 0.239492 0.227593 0.210145 0.227134 0.261934
chargesum: 0.00000
title: Mulliken charges with hydrogens summed into heavy atoms:
elementType: Cl Cl Cl Cl P P O O O O O O C C C C C C C C C C C C
charge: 0.034933 0.046597 0.016797 0.035396 1.278257 1.275964 -0.490423 -0.523537 -0.291961 -0.263555 -0.593991 -0.608871 0.787104 0.776581 -0.315783 -0.288303 -0.328866 -0.361029 -0.338855 -0.343034 0.206532 0.211246 0.030303 0.048496
polarizability: 3.19199587e+02 4.28044105e+00 2.57107704e+02 1.19762400e+00 1.47528761e+01 1.60992339e+02
1716.lowfreq: -23.5015 -8.6385 -2.2010 -0.0022 0.0006 0.0008 7.0140 12.8230 17.0927
frequency: -23.2421 12.3466 16.6615 18.2228 29.3623 37.7599 41.3372 56.9383 66.3990 78.5500 82.3341 90.5140 105.4160 119.7956 127.2502 143.7456 171.3421 173.6806 191.5830 193.6034 213.0164 214.5667 228.4888 229.3905 240.3789 272.7906 279.9398 303.4794 307.7115 308.7235 324.1568 326.2722 334.2984 338.6211 345.6606 361.3479 373.3384 380.3957 405.9685 414.1822 452.4572 481.0291 510.3163 568.6210 577.3555 593.3352 598.4036 605.8974 651.9779 663.1766 679.6124 691.8166 741.3981 794.9418 796.4695 804.8129 808.0356 835.8265 869.5857 872.1041 886.6181 907.7695 973.1819 982.6343 989.3233 1012.9155 1018.3168 1056.6343 1068.2197 1090.9703 1094.8758 1100.8664 1140.0340 1149.5336 1152.0391 1180.1806 1261.3672 1261.9130 1266.4628 1267.1332 1275.6618 1342.3193 1346.9041 1347.8814 1356.8351 1385.9720 1392.8962 1403.0600 1423.0689 1429.3746 1459.0832 1460.5398 1463.1695 1474.0655 1483.6096 1490.8931 1523.4999 1572.9705 2984.5084 2988.0282 2991.2444 3003.1348 3051.8154 3054.3090 3071.9734 3078.7243 3085.1957 3086.9511 3110.3788 3111.7694 3127.8856 3128.3961 3582.5367 3591.7244
redmass: 2.3591 4.5614 5.4392 7.1633 8.8570 7.2037 4.3333 8.4307 13.6608 6.1440 6.2427 5.6649 11.0816 3.5624 4.8991 8.9145 6.5047 4.4331 3.3164 9.2680 28.4049 24.5540 2.2546 1.5811 1.8650 2.0555 2.6606 4.4179 12.7654 7.0682 4.3572 3.6235 2.4931 11.4947 2.5784 2.4516 3.1069 3.2655 4.4639 3.6236 4.7566 8.7727 6.2334 5.9420 3.9732 7.1274 11.7548 6.3788 7.7846 7.2018 8.6779 9.6611 7.3294 1.3563 3.4360 1.1325 10.5328 7.4966 3.1825 3.2533 1.9459 1.9272 4.2701 1.7131 1.5523 2.8214 3.2456 2.6049 5.3313 2.2218 2.1290 7.4778 1.5407 1.4714 1.3419 1.1574 1.1346 1.1638 6.7396 1.2905 1.1886 8.1541 1.2535 1.2694 3.8840 1.2336 1.2238 3.5209 1.1790 1.2755 1.0428 1.0399 1.0732 1.0717 1.0549 1.0590 8.1627 11.2861 1.0589 1.0365 1.0411 1.0632 1.0581 1.0577 1.1004 1.1024 1.0972 1.0968 1.1033 1.1026 1.1046 1.1050 1.0661 1.0661
irintensity: 1.2762 0.9078 1.0514 0.6198 0.0978 0.2856 0.6073 1.8851 0.0569 0.2947 0.9070 0.4365 1.9523 6.0578 4.5363 7.8226 0.1711 1.7415 16.1882 1.8506 0.2429 0.1755 5.0336 12.8065 17.7360 10.0832 3.8998 39.3535 10.4014 36.8484 18.2350 72.6200 67.6132 1.5167 57.4872 9.8473 13.4467 40.8792 5.9033 6.7336 39.1615 1.6920 10.7154 22.9650 0.6523 7.3212 0.9250 37.3266 130.1237 218.3636 80.2160 45.3958 72.2437 1.1416 9.1032 9.2158 0.1919 68.6298 207.3552 64.8088 59.1735 51.7491 23.2080 7.0740 21.1576 167.6988 176.7371 151.7685 103.5301 7.5643 12.5134 77.8145 7.7179 8.9461 3.6714 0.7395 2.5716 2.8892 0.7225 11.7089 9.7852 81.2002 20.1658 12.6892 56.7764 29.3710 36.3494 12.5190 23.1996 40.7694 14.5308 12.6902 3.6335 2.6743 9.4766 12.0514 0.2286 1.8665 39.8443 23.4652 20.6549 32.9800 0.9565 1.4192 4.3383 4.5866 33.0640 29.6263 28.7231 29.9919 2.1470 3.8932 54.1491 63.6648
temp: 298.150 k
press: 1.00000 atm
elementType: 17 17 17 17 15 15 8 8 8 8 8 8 6 6 6 6 6 6 6 6 6 6 6 6 1 1 1 1 1 1 1 1 1 1 1 1 1 1 1 1
symmnumber: 1
zpe: 712364.9 jmol-1
zpe.correction: 0.271325 hartree
zpe.thermalcorrener: 0.300110 hartree
zpe.thermalcorrenthalpy: 0.301054 hartree
zpe.thermalcorrgfe: 0.207172 hartree
zpe.sumelectzpe: -3439.039725 hartree
zpe.sumelectthermal: -3439.010940 hartree
zpe.sumelectthermalent: -3439.009996 hartree
zpe.sumelectthermalfe: -3439.103878 hartree
dipole: -2.9310 -2.7111 -2.6089
dipole: 4.7694
quadrupole: -149.7173 -187.1032 -184.9533
quadrupole: -5.6875 0.6349 -6.2359
quadrupole: 24.2073 -13.1786 -11.0288 -5.6875 0.6349 -6.2359
hfenergy: -3439.31105 hartree
pointgroup: C01 [X(C12H16Cl4O6P2)]
dipole: -1.2418353 -0.8805131 -1.0970436 debye
polarizability: 319.5180322|-0.5023719|253.4918669|0.811443|22.8391295|164.28973 unknown
InChI: InChI=1S/C12H16Cl4O6P2/c1-3-21-23(17,18)5-7-9(13)11(15)8(12(16)10(7)14)6-24(19,20)22-4-2/h17,19H,3-6H2,1-2H3
charge 0 multiplicity 1
40 atoms
Cl -1.305991 3.766982 -0.490779
Cl 1.872645 3.444965 -0.624783
Cl -1.902128 -1.589658 -1.884891
Cl 1.27181 -1.902187 -2.024177
P  -3.537879 0.983458 0.747271
P  3.693892 0.138386 0.289116
O  -3.988498 -0.680106 0.934261
O  4.701278 -1.126225 -0.312822
O  -5.039523 1.865525 0.599491
O  2.452369 -0.7451 1.134571
O  -2.568778 1.431539 1.919218
O  4.368232 1.263629 1.196529
C  -1.455028 1.066686 -1.158511
C  1.421996 0.783917 -1.308093
C  -2.947593 1.217287 -1.043438
C  2.917463 0.630708 -1.368008
C  -0.587815 2.162198 -0.906306
C  0.813535 2.023174 -0.977011
C  -0.846124 -0.164687 -1.512371
C  0.554442 -0.305836 -1.584605
C  -5.086574 -1.306845 0.144525
C  5.59984 -1.862794 0.626464
C  -6.401176 -1.290981 0.927296
C  6.904385 -1.100769 0.87781
H  -3.27114 2.2359 -1.306363
H  -3.48053 0.486616 -1.670356
H  3.217942 -0.169591 -2.060713
H  3.410797 1.57507 -1.646313
H  -5.201244 -0.804101 -0.836849
H  -4.727375 -2.335578 -0.026252
H  5.774137 -2.818707 0.105599
H  5.053506 -2.066507 1.567583
H  -5.405609 2.183351 1.464119
H  2.215446 -0.338768 2.007985
H  -7.16456 -1.888099 0.393233
H  -6.255552 -1.732025 1.927956
H  -6.782215 -0.261888 1.039762
H  7.574981 -1.710383 1.512749
H  7.423525 -0.894598 -0.074014
H  6.71001 -0.14266 1.388918
