program: Gaussian 09
title: 000267881
version: EM64L-G09RevD.01
frameworkgroup: C1[X(C13H8I2N2O2)]
method: RPBEPBE
basis: SDD
operation: Freq
keyword: #p
keyword: freq=noraman
keyword: PBEPBE/SDD
title: #p freq=noraman PBEPBE/SDD
converged: NO YES NO NO
title: Mulliken charges:
elementType: I I O O N N C C C C C C C C C C C C C H H H H H H H H
charge: 0.095229 0.110303 -0.217882 -0.218405 -0.677893 0.013923 -0.711634 0.421711 0.327886 0.233623 0.185747 -0.806406 -0.589027 -0.364777 -0.354268 0.879693 0.410519 -0.624188 -0.393230 0.273718 0.273718 0.299580 0.261696 0.248994 0.286826 0.317204 0.317340
chargesum: 0.00000
title: Mulliken charges with hydrogens summed into heavy atoms:
elementType: I I O O N N C C C C C C C C C C C C C
charge: 0.095229 0.110303 -0.217882 -0.218405 -0.043349 0.013923 -0.164198 0.421711 0.327886 0.233623 0.185747 -0.806406 -0.289448 -0.103081 -0.105274 0.879693 0.410519 -0.624188 -0.106405
polarizability: 4.46924098e+02 -1.11903285e+01 2.65760926e+02 -5.91284256e-03 1.63018411e-02 7.08305813e+01
1716.lowfreq: -0.0005 0.0005 0.0005 0.3187 2.8251 3.9447 40.0650 50.0592 66.7716
frequency: 40.0635 50.0585 66.7712 71.6636 85.1492 97.9693 128.2367 165.6506 171.4788 204.8160 256.9509 258.2362 264.7891 274.9544 313.7944 366.6046 425.2859 434.7068 453.7873 457.9711 492.7762 499.2187 513.4677 524.5441 577.9440 588.5824 623.3730 625.2106 682.4689 687.6189 734.6270 739.6249 758.1161 767.6448 778.8211 847.4282 889.7764 896.4761 905.8212 965.9490 969.1193 987.8136 999.7428 1060.0281 1070.7423 1121.0944 1138.0850 1166.8493 1184.9770 1201.4757 1219.6439 1244.4506 1273.5172 1329.8448 1353.6733 1357.0310 1396.7935 1424.2476 1435.6040 1451.1946 1462.6679 1475.7958 1547.4404 1588.5654 1598.9329 1619.0911 1634.6991 2987.5408 3031.4084 3145.9282 3162.0705 3173.8284 3185.8535 3509.7337 3651.7086
redmass: 10.0311 10.8742 21.1651 6.2332 4.7248 26.7108 6.5930 28.5264 11.5030 3.3958 7.2399 5.9480 7.5760 2.7114 6.5315 5.6419 4.6679 2.8735 1.0567 7.8999 2.4930 1.7687 3.0455 5.8624 4.3319 5.6682 8.4055 4.5073 8.3316 5.3306 6.0230 5.5447 9.2342 4.2437 6.2755 1.4595 1.5558 4.6322 1.6515 3.1125 1.8329 1.3602 8.4030 1.8294 1.9428 1.7894 1.1442 2.8797 3.0228 2.7010 2.4454 1.8213 1.4026 4.3540 8.3364 4.4315 5.2612 1.2054 3.9139 5.0838 5.4115 4.6858 7.2774 7.7538 4.5167 5.0558 1.5765 1.0612 1.0989 1.0908 1.0928 1.0928 1.0948 1.0455 1.1038
irintensity: 0.8301 0.0074 0.5288 0.2350 0.0163 0.0338 6.5432 0.1010 2.3790 0.5282 2.2982 4.1328 0.3188 7.2793 3.4150 8.4709 5.3965 14.6286 0.4586 6.8582 85.1821 127.4405 29.5870 5.1276 6.3492 8.4694 18.8123 4.1322 38.5281 24.4635 4.6194 0.9404 30.9595 17.5673 12.9631 41.8656 10.2904 4.2050 1.5207 37.3043 24.0193 0.7307 46.4582 61.6610 73.0003 43.8727 0.0275 16.5636 53.6365 474.2848 438.1847 95.0473 0.9543 32.9011 94.0584 117.3238 24.1179 4.1737 2.5092 5.0032 194.1724 15.5497 25.1876 31.3288 71.3943 286.7863 279.9548 3.8376 2.4351 6.7796 0.8463 1.6220 1.4663 169.1618 64.0165
temp: 298.150 k
press: 1.00000 atm
elementType: 53 53 8 8 7 7 6 6 6 6 6 6 6 6 6 6 6 6 6 1 1 1 1 1 1 1 1
symmnumber: 1
zpe: 477606.8 jmol-1
zpe.correction: 0.181911 hartree
zpe.thermalcorrener: 0.198557 hartree
zpe.thermalcorrenthalpy: 0.199501 hartree
zpe.thermalcorrgfe: 0.134429 hartree
zpe.sumelectzpe: -781.782956 hartree
zpe.sumelectthermal: -781.766309 hartree
zpe.sumelectthermalent: -781.765365 hartree
zpe.sumelectthermalfe: -781.830437 hartree
dipole: -8.0118 1.0186 0.0004
dipole: 8.0763
quadrupole: -183.6406 -127.2336 -142.4155
quadrupole: 2.0884 0.0023 0.0020
quadrupole: -32.5441 23.8630 8.6811 2.0884 0.0023 0.0020
hfenergy: -781.9648664 hartree
pointgroup: C01 [X(C13H8I2N2O2)]
dipole: -3.1771895 0.0423842 0.0001421 debye
polarizability: 447.1258935|9.4140744|265.55913|-0.0077152|0.0155302|70.8305813 unknown
InChI: InChI=1S/C13H8I2N2O2/c14-11-5-9-8-2-1-7(17(18)19)3-6(8)4-10(9)12(15)13(11)16/h1-3,5H,4,16H2
charge 0 multiplicity 1
27 atoms
I  -3.245326 3.269558 0.00063
I  -4.727678 -2.77879 -0.000208
O  5.524175 -0.953177 -0.000196
O  5.174397 1.302491 0.000085
N  -5.050265 0.501053 0.000235
N  4.745057 0.080608 0.000056
C  -0.100835 1.745563 0.000354
C  -1.329677 0.849886 0.000248
C  1.047206 0.745351 0.000196
C  -0.932118 -0.525013 0.000053
C  0.53193 -0.591803 0.000021
C  -2.685287 1.18509 0.000312
C  2.424963 0.983453 0.000202
C  -1.905445 -1.547593 -0.000074
C  1.410948 -1.701414 -0.000146
C  -3.710724 0.176436 0.00018
C  3.285719 -0.143613 0.000033
C  -3.262875 -1.191643 -0.000011
C  2.799994 -1.474178 -0.000139
H  -0.07888 2.409627 0.886412
H  -0.078911 2.409873 -0.885521
H  2.856462 1.987841 0.000329
H  -1.613654 -2.601316 -0.000218
H  1.02609 -2.72627 -0.000281
H  3.519101 -2.297163 -0.000259
H  -5.344508 1.476192 0.000366
H  -5.755958 -0.233547 0.000138
