program: Gaussian 09
title: 000267861
version: EM64L-G09RevD.01
frameworkgroup: C1[X(C15H13NO)]
method: RPBEPBE
basis: SDD
operation: Freq
keyword: #p
keyword: freq=noraman
keyword: PBEPBE/SDD
title: #p freq=noraman PBEPBE/SDD
converged: YES YES NO NO
title: Mulliken charges:
elementType: O N C C C C C C C C C C C C C C C H H H H H H H H H H H H H
charge: -0.435574 -0.110612 -0.704069 0.290379 0.182692 0.276841 0.185882 -0.584679 -0.399237 0.372608 -0.423861 -0.394525 -0.382674 -0.236831 -0.235652 0.087903 -0.806104 0.245021 0.245007 0.252018 0.238697 0.241001 0.239591 0.270609 0.225565 0.226034 0.286397 0.238862 0.238946 0.369763
chargesum: 0.00000
title: Mulliken charges with hydrogens summed into heavy atoms:
elementType: O N C C C C C C C C C C C C C C C
charge: -0.065811 -0.110612 -0.214041 0.290379 0.182692 0.276841 0.185882 -0.332661 -0.160539 0.372608 -0.182860 -0.154933 -0.112065 -0.011266 -0.009618 0.087903 -0.041898
polarizability: 3.41281513e+02 -8.78687320e+00 1.71792646e+02 -1.42220694e-02 4.22033451e-03 7.41323762e+01
1716.lowfreq: -0.0010 -0.0004 0.0007 2.6968 3.4722 11.0821 34.7550 51.4498 112.1794
frequency: 34.6027 51.4492 112.1790 128.1446 149.7464 152.0043 220.0520 238.6004 255.9797 260.7491 327.6749 352.0279 410.2693 414.7517 427.6833 436.9462 478.3605 487.0861 516.9104 538.2221 546.8288 613.9269 630.5590 642.4947 712.2327 715.0973 745.9263 747.7059 782.1589 817.3604 851.5913 856.6284 869.3468 888.4010 913.2756 939.2544 968.6776 977.8613 986.5149 989.5605 995.8936 1024.9688 1037.3210 1079.0653 1100.3267 1130.3205 1132.9016 1168.0000 1175.7515 1188.6471 1203.4507 1241.5770 1259.8252 1297.2355 1306.3395 1346.7717 1365.9862 1385.5007 1391.0275 1425.9457 1442.3563 1449.8168 1460.5593 1462.8401 1483.2266 1494.7658 1558.8543 1590.5396 1591.0390 1620.5977 1624.8897 2981.6922 2990.3216 3025.5623 3067.3709 3121.0643 3128.2825 3132.3887 3132.9245 3142.1699 3143.8939 3160.8752 3168.2651 3572.8860
redmass: 4.0311 4.7469 5.3254 3.8476 4.4211 1.0765 4.6939 2.2228 5.7126 5.9656 4.2180 3.9877 2.0117 4.1911 1.6589 2.8589 6.3972 2.3716 4.0738 3.1149 6.0465 2.9466 6.4907 6.0477 2.8191 4.3555 1.5989 5.2762 2.3075 4.4305 6.4013 1.4640 1.4020 1.4365 4.4765 1.5421 1.8768 2.0646 1.3414 1.3590 6.4153 2.1399 1.5901 2.0336 2.0167 1.7752 1.1483 1.1817 1.5693 1.8230 1.8270 1.6593 1.5973 1.4510 1.8355 3.1738 4.4632 1.6786 2.5293 1.1781 4.2758 2.5852 2.1090 1.2453 1.0475 3.5164 5.4394 7.0960 6.6369 7.2638 7.0067 1.0608 1.0388 1.0993 1.0975 1.0855 1.0894 1.0965 1.0898 1.0947 1.0908 1.1003 1.0949 1.0673
irintensity: 0.0329 0.4277 0.2920 0.0099 0.1265 0.0031 1.1289 9.1112 0.7560 3.6993 14.1682 2.0079 77.9826 4.1446 36.6104 0.0001 20.9917 28.4265 1.9742 7.7304 0.3981 5.6785 4.2053 12.1961 0.2711 20.9481 70.3966 1.2411 35.6662 1.7271 87.8869 30.3689 0.3606 5.9293 88.5355 2.3341 15.2350 88.7508 0.1640 0.1927 1.3522 5.3031 0.4919 1.0274 7.6590 3.5249 0.0231 2.4243 4.6139 1.5234 2.9611 94.0724 68.2112 0.4068 2.3880 6.3989 8.5502 19.0422 33.1160 12.7009 13.6000 10.6782 0.9815 30.2506 20.5945 8.1589 0.6955 0.2444 4.1566 1.8982 2.0445 14.0013 10.9620 7.9089 14.7125 4.3207 5.8244 12.6046 4.4265 32.9925 9.8297 42.9733 4.7895 97.3093
temp: 298.150 k
press: 1.00000 atm
elementType: 8 7 6 6 6 6 6 6 6 6 6 6 6 6 6 6 6 1 1 1 1 1 1 1 1 1 1 1 1 1
symmnumber: 1
zpe: 622015.6 jmol-1
zpe.correction: 0.236913 hartree
zpe.thermalcorrener: 0.250988 hartree
zpe.thermalcorrenthalpy: 0.251933 hartree
zpe.thermalcorrgfe: 0.195826 hartree
zpe.sumelectzpe: -708.166275 hartree
zpe.sumelectthermal: -708.152200 hartree
zpe.sumelectthermalent: -708.151256 hartree
zpe.sumelectthermalfe: -708.207363 hartree
dipole: -0.5407 0.9711 -0.0020
dipole: 1.1115
quadrupole: -88.2403 -84.6425 -104.6171
quadrupole: -2.7030 -0.0147 0.0038
quadrupole: 4.2597 7.8574 -12.1171 -2.7030 -0.0147 0.0038
hfenergy: -708.4031885 hartree
pointgroup: C01 [X(C15H13N1O1)]
dipole: -0.2112483 -0.3828795 -0.0016329 debye
polarizability: 341.0799335|9.5192757|171.8332994|-5.8156681|1.6181361|74.2933027 unknown
InChI: InChI=1S/C15H13NO/c1-10(16-17)11-6-7-15-13(8-11)9-12-4-2-3-5-14(12)15/h2-8,17H,9H2,1H3
charge 0 multiplicity 1
30 atoms
O  5.793891 0.561924 -0.16234
N  4.366764 0.898636 -0.12506
C  -1.303512 -1.812625 -0.048463
C  -0.152794 -0.811925 -0.056432
C  -0.665341 0.519145 -0.020023
C  -2.535258 -0.914443 -0.00397
C  -2.137035 0.458548 0.012419
C  1.229569 -1.049647 -0.092386
C  0.226808 1.618053 -0.019966
C  2.13753 0.049487 -0.092597
C  -3.896716 -1.262349 0.020407
C  -3.106619 1.486178 0.053218
C  1.611974 1.378752 -0.055812
C  -4.868991 -0.230684 0.061303
C  -4.475116 1.13124 0.077487
C  3.607667 -0.188501 -0.130034
C  4.150869 -1.602518 -0.16885
H  -1.256592 -2.490749 0.826491
H  -1.296912 -2.458637 -0.948584
H  1.606828 -2.077267 -0.12006
H  -0.150059 2.646636 0.007621
H  -4.209369 -2.313054 0.008102
H  -2.808955 2.540794 0.065944
H  2.319502 2.212857 -0.056314
H  -5.934335 -0.486604 0.0806
H  -5.240566 1.914777 0.109113
H  5.249559 -1.594381 -0.190819
H  3.817427 -2.170776 0.71885
H  3.781166 -2.134937 -1.064355
H  6.212514 1.460174 -0.15309
