program: Gaussian 09
title: 000267869
version: EM64L-G09RevD.01
frameworkgroup: C1[X(C11H12Cl2N2O3)]
method: RPBEPBE
basis: SDD
operation: Freq
keyword: #p
keyword: freq=noraman
keyword: PBEPBE/SDD
title: #p freq=noraman PBEPBE/SDD
converged: YES YES NO NO
title: Mulliken charges:
elementType: Cl Cl O O O N N C C C C C C C C C C C H H H H H H H H H H H H
charge: 0.034487 0.003490 -0.311809 -0.266553 -0.237028 -0.439828 -0.416024 0.366181 0.581908 -0.603234 0.130014 -0.399878 -0.301552 0.214488 0.339318 -0.795953 -0.723629 -0.527202 0.313410 0.305098 0.244196 0.350145 0.335672 0.357128 0.239158 0.266947 0.237904 0.229755 0.229963 0.243430
chargesum: 0.00000
title: Mulliken charges with hydrogens summed into heavy atoms:
elementType: Cl Cl O O O N N C C C C C C C C C C C
charge: 0.034487 0.003490 -0.311809 -0.266553 -0.237028 -0.089683 -0.080352 0.366181 0.581908 -0.289823 0.130014 -0.094781 -0.057357 0.214488 0.339318 -0.051945 -0.366502 0.175945
polarizability: 2.54584048e+02 8.05494609e-01 1.91725054e+02 -3.34482472e-02 -1.69442745e+00 9.94717981e+01
1716.lowfreq: -81.5283 -2.3662 -0.0024 -0.0018 -0.0017 6.4081 9.7718 21.4283 35.6445
frequency: -81.5259 21.0592 35.6378 58.0703 65.3584 71.4107 94.4548 97.9704 128.3040 141.9073 149.8539 197.7965 218.8767 239.7766 246.0314 271.1359 279.1180 315.3692 348.3827 390.2728 392.2631 441.6505 457.9666 503.3997 557.4501 572.9934 583.5149 625.1311 629.2439 651.8500 691.1529 711.4231 721.8083 740.7101 749.6297 756.3539 811.6652 820.4365 903.4803 925.8088 936.3352 954.6403 973.0443 993.0806 1014.5873 1032.1873 1116.7444 1125.4215 1151.1024 1180.3862 1183.8225 1203.7964 1209.7239 1228.1486 1250.5697 1261.8176 1313.0599 1376.2213 1392.0574 1424.2495 1439.8585 1447.8981 1466.3832 1466.9450 1470.6807 1485.0637 1520.5507 1542.8663 1610.9684 1614.1671 1623.0128 1627.5614 2969.3437 2989.4746 3061.0182 3074.6402 3129.5387 3136.9729 3158.8639 3163.0531 3163.7025 3200.6058 3484.1321 3500.9747
redmass: 1.0374 13.3646 8.0759 6.1825 8.5901 4.9621 4.4633 3.9038 5.7887 6.5985 5.2940 3.4105 5.0407 1.5310 11.2941 5.2825 4.8049 4.3894 5.4431 9.7007 6.0528 7.2512 3.1385 4.3730 5.0011 3.2171 6.8536 6.4130 3.1732 5.5546 3.6968 1.5139 1.3398 7.1593 2.8955 5.6338 5.5816 1.4211 5.0254 1.4822 5.8892 1.3254 2.2835 6.2108 2.3778 1.6668 1.2566 2.3041 1.4353 1.4366 1.2861 1.5594 1.7972 1.8224 2.4560 1.8615 2.3935 1.2381 6.4345 2.2415 1.5280 1.2411 1.0498 1.0471 1.2596 1.5065 2.5970 2.0806 6.7360 6.5995 5.0521 6.2374 1.0323 1.0382 1.1046 1.0983 1.1004 1.0982 1.0932 1.0900 1.0895 1.0950 1.0767 1.0765
irintensity: 0.2034 0.0895 3.1328 0.4080 1.2518 1.5379 20.0063 1.6014 3.3124 6.3339 1.6744 1.2680 0.6563 0.6596 1.7498 3.6694 2.0033 0.7471 0.3115 2.2140 2.9896 57.6394 10.8086 24.3215 10.5415 4.2457 62.2810 16.7447 11.8804 1.8860 60.2719 110.1320 56.0713 43.6439 3.2124 20.5069 10.6317 55.9821 2.2431 59.0640 10.2347 3.1428 2.1767 61.6321 41.4062 8.5276 0.1228 78.5178 2.8889 12.9265 5.7739 21.9473 57.8609 28.8368 62.1855 121.1829 11.9971 52.7016 33.7485 259.0093 86.0293 47.2200 20.8546 13.4724 109.6500 52.9486 528.8330 119.6885 209.6508 200.3234 32.0262 72.2748 69.2369 8.0203 39.6772 14.6434 20.2100 7.1379 10.7891 13.5842 0.5455 5.8213 35.6808 52.9743
temp: 298.150 k
press: 1.00000 atm
elementType: 17 17 8 8 8 7 7 6 6 6 6 6 6 6 6 6 6 6 1 1 1 1 1 1 1 1 1 1 1 1
symmnumber: 1
zpe: 575930.1 jmol-1
zpe.correction: 0.219360 hartree
zpe.thermalcorrener: 0.237296 hartree
zpe.thermalcorrenthalpy: 0.238240 hartree
zpe.thermalcorrgfe: 0.170839 hartree
zpe.sumelectzpe: -1680.353260 hartree
zpe.sumelectthermal: -1680.335325 hartree
zpe.sumelectthermalent: -1680.334381 hartree
zpe.sumelectthermalfe: -1680.401781 hartree
dipole: 6.2564 -2.1656 -0.2543
dipole: 6.6255
quadrupole: -94.7948 -119.8594 -122.2430
quadrupole: -10.0857 3.1658 0.0620
quadrupole: 17.5043 -7.5603 -9.9439 -10.0857 3.1658 0.0620
hfenergy: -1680.5726206 hartree
pointgroup: C01 [X(C11H12Cl2N2O3)]
dipole: 2.3170521 -1.1941235 -0.0111533 debye
polarizability: 253.5063245|-7.9217575|192.4668312|2.7588467|-5.5659781|99.8077452 unknown
InChI: InChI=1S/C11H12Cl2N2O3/c1-6(16)14-8-5-7(3-4-9(8)18-2)15-11(17)10(12)13/h3-5,10,14-15H,1-2H3
charge 0 multiplicity 1
30 atoms
Cl -4.850779 1.168224 1.54224
Cl -4.069369 2.362416 -1.182489
O  3.292696 -1.700212 0.287378
O  2.091786 3.086644 0.138503
O  -3.379324 -1.423609 -0.297862
N  2.961249 0.910929 0.232502
N  -1.921406 0.426094 -0.105516
C  1.778408 0.136348 0.156267
C  -0.641781 -0.197755 -0.013868
C  0.478837 0.671465 0.0562
C  1.949354 -1.284095 0.185696
C  -0.472188 -1.602614 0.013988
C  0.832786 -2.135297 0.114676
C  3.082534 2.300745 0.222924
C  -3.150014 -0.177649 -0.225162
C  4.524503 2.795097 0.325818
C  -4.361779 0.765656 -0.223201
C  3.556863 -3.140473 0.322563
H  0.368501 1.759402 0.035119
H  -1.340533 -2.259941 -0.045643
H  0.958335 -3.221513 0.135757
H  3.816765 0.350622 0.302384
H  -1.919586 1.452137 -0.116181
H  -5.226306 0.2726 -0.680955
H  4.993218 2.464775 1.271242
H  4.522061 3.893934 0.29625
H  5.139384 2.416409 -0.511496
H  3.203207 -3.630239 -0.60448
H  3.075854 -3.609677 1.201653
H  4.649725 -3.234823 0.400795
