program: Gaussian 09
title: 000267842
version: EM64L-G09RevD.01
frameworkgroup: C1[X(C8H8N2O2)]
method: RPBEPBE
basis: SDD
operation: Freq
keyword: #pfreq=noraman
keyword: PBEPBE/SDD
title: #p freq=noraman PBEPBE/SDD
converged: YES YES NO NO
title: Mulliken charges:
elementType: O O N N C C C C C C C C H H H H H H H H
charge: -0.158674 -0.142361 -0.244704 0.086340 0.446205 0.462294 -0.365371 -0.372391 -0.347918 -0.372199 -0.800233 -0.075748 0.256336 0.252839 0.238732 0.238388 0.228698 0.230696 0.240863 0.198209
chargesum: 0.00000
title: Mulliken charges with hydrogens summed into heavy atoms:
elementType: O O N N C C C C C C C C
charge: -0.158674 -0.142361 -0.244704 0.086340 0.446205 0.462294 -0.126639 -0.134003 -0.091582 -0.119360 -0.099976 0.122461
polarizability: 1.76023805e+02 -4.88187065e+00 1.07396873e+02 2.61818639e+00 3.97468108e+00 5.63842444e+01
1716.lowfreq: -6.6024 -4.3397 -0.0008 -0.0003 0.0005 6.0748 29.1571 53.2022 75.5116
frequency: 28.7890 53.1955 75.5098 106.9131 161.2589 199.1707 208.1579 221.6281 311.4856 321.9582 369.9706 403.5007 409.2209 470.6625 526.4387 583.4169 635.5794 702.7442 717.8086 791.2870 819.5433 835.2525 933.1899 946.2959 955.4228 967.4331 988.9316 1010.5168 1042.7256 1048.2265 1128.2780 1193.9979 1224.8220 1273.1825 1310.0001 1367.5898 1382.7972 1399.4120 1411.6251 1436.4146 1471.6809 1473.6969 1501.8648 1583.2113 1613.7056 1626.1330 2920.9559 2978.5071 3060.5846 3090.3019 3129.5368 3134.0270 3153.1399 3171.4897
redmass: 1.0246 5.7365 4.9138 5.6651 5.7916 4.8849 9.8518 3.1159 4.3254 4.8846 4.4185 5.7667 2.9243 6.6617 2.8750 5.6814 6.7876 5.7396 3.6047 5.2776 1.5019 1.2665 2.7175 1.6298 2.0644 1.3782 1.4317 3.0035 4.6397 1.6025 1.2898 1.1048 2.8512 4.6644 1.2914 5.5588 1.2065 1.2198 3.5459 8.0138 1.1173 1.0608 2.7156 6.4982 7.2166 7.2078 1.0880 1.0390 1.0947 1.0999 1.0881 1.0897 1.0968 1.0957
irintensity: 0.4975 0.4710 0.4284 3.5353 5.4350 4.3842 2.8690 6.3444 5.4042 1.3280 2.2953 14.3636 0.2529 6.0886 48.3548 7.7376 1.0269 113.7811 53.7124 9.1080 55.8992 4.9039 21.7937 5.1308 22.4136 0.5513 3.3962 22.3382 222.9136 42.6157 26.4701 1.7473 2.1173 38.6640 3.1785 11.9260 9.9938 12.2445 10.1315 160.0709 21.6720 13.6034 71.5495 11.7621 115.1658 155.9644 59.1598 27.8782 20.1698 15.9530 11.5678 17.5736 9.4126 2.1850
temp: 298.150 k
press: 1.00000 atm
elementType: 8 8 7 7 6 6 6 6 6 6 6 6 1 1 1 1 1 1 1 1
symmnumber: 1
zpe: 382106.3 jmol-1
zpe.correction: 0.145537 hartree
zpe.thermalcorrener: 0.157246 hartree
zpe.thermalcorrenthalpy: 0.158190 hartree
zpe.thermalcorrgfe: 0.106494 hartree
zpe.sumelectzpe: -568.655116 hartree
zpe.sumelectthermal: -568.643407 hartree
zpe.sumelectthermalent: -568.642463 hartree
zpe.sumelectthermalfe: -568.694159 hartree
dipole: 6.2333 -0.7902 0.8042
dipole: 6.3344
quadrupole: -80.7356 -66.3998 -69.8049
quadrupole: -0.6260 -0.6001 3.8761
quadrupole: -8.4222 5.9136 2.5085 -0.6260 -0.6001 3.8761
hfenergy: -568.800653 hartree
pointgroup: C01 [X(C8H8N2O2)]
dipole: -2.4458207 -0.2457365 -0.4103163 debye
dipolederiv: -1.0067722 0.4599375 0.1674224 0.2702693 -0.4320383 -0.0796559 -0.0389939 -0.0029917 -0.3266596 -1.2617159 -0.8200353 -0.4418751 -0.1593479 -0.2436503 -0.1023036 0.087043 0.0031247 -0.0865948 -0.7088076 0.091141 0.0066129 -0.1508734 -1.2230683 -0.617965 -0.112313 -0.6043059 -0.3972756 1.2208491 1.0779685 0.5834345 0.7387586 0.8307724 0.4914383 0.1553922 0.3674644 0.1627915 0.4796627 0.0055478 0.0371028 -0.0064581 -0.0541538 0.0081663 0.1045328 -0.0008612 -0.0246827 0.6836345 -0.0163546 -0.0033119 -0.0200451 0.0163762 -0.0890677 0.0889155 -0.0538506 0.0180543 -0.190804 -0.0712157 0.005083 -0.1935346 0.0826989 -0.0660751 0.0363099 -0.0531473 -0.140932 -0.1944595 0.047606 -0.0118265 0.2039296 0.0831501 -0.0357702 -0.0696959 -0.0433277 -0.1504523 -0.0361802 0.0534469 0.0090583 0.058907 -0.0061243 -0.0385398 0.0235503 -0.0115646 -0.1130108 -0.046278 -0.0161752 0.0188671 -0.0236664 0.0060711 -0.0399 -0.0038496 -0.0505773 -0.1198769 -0.1829735 -0.0001967 -0.0222356 -0.0056141 0.0756245 -0.0010937 -0.1493439 -0.00407 0.0579848 1.18185 -0.718846 -0.1993801 -0.672415 0.9106828 0.4777033 -0.0805652 0.3951464 0.5108172 0.034124 -0.0781068 0.0171423 -0.0656975 0.0259279 0.0434027 0.0257502 0.0266954 0.1509953 0.0271771 0.0875621 -0.023824 0.0877003 0.0033112 0.050302 -0.029124 0.0475129 0.1422344 0.0148312 0.0886015 -0.0202067 0.0921671 -0.0368528 0.0450653 -0.0145118 0.0399677 0.1389804 0.007202 -0.0918004 0.0200709 -0.0924211 -0.0339838 0.039017 0.0215621 0.0410386 0.1409929 0.0183493 -0.0212111 0.0236503 -0.0920537 -0.0295239 0.1116849 0.0967055 0.0928913 0.0374216 0.0141829 0.0256124 0.0135995 0.1081545 -0.0835376 -0.0715988 0.0629852 -0.0520325 0.0927046 -0.0292347 -0.0064673 -0.0498478 -0.0160311 0.1120967 -0.0305837 -0.0968391 -0.0307462 -0.0917548 -0.0246372 -0.0970146 -0.129536 -0.0617284 -0.0037785 -0.0942262 -0.1075103 -0.1063665 -0.0017375 unknown
polarizability: 175.8846318|3.8482533|107.4796778|5.9865263|2.8722775|56.4406132 unknown
InChI: InChI=1S/C8H8N2O2/c1-7-2-4-8(5-3-7)10(6-11)9-12/h2-6H,1H3
charge 0 multiplicity 1
20 atoms
O  3.440322 -1.350836 -0.371828
O  3.323219 1.23677 0.728367
N  1.491087 -0.06344 0.113845
N  2.07603 1.1492 0.768652
C  -2.796266 -0.01217 0.024311
C  0.052757 -0.044874 0.081363
C  -2.044793 1.169482 -0.211031
C  -2.08594 -1.208372 0.302121
C  -0.636188 1.161325 -0.194866
C  -0.676334 -1.231086 0.342922
C  -4.312458 0.00112 -0.040239
C  2.219529 -1.126778 -0.503592
H  -0.070207 2.075488 -0.395657
H  -0.150843 -2.154469 0.610273
H  -2.570806 2.108314 -0.420223
H  -2.641812 -2.130895 0.506038
H  -4.752171 -0.799161 0.579863
H  -4.724585 0.966052 0.303167
H  -4.665746 -0.155126 -1.078067
H  1.547605 -1.739341 -1.148419
