program: Gaussian 09
title: 000267857
version: EM64L-G09RevD.01
frameworkgroup: C1[X(C15H9F3N2O2)]
method: RPBEPBE
basis: SDD
operation: Freq
keyword: #p
keyword: freq=noraman
keyword: PBEPBE/SDD
title: #p freq=noraman PBEPBE/SDD
converged: YES YES NO NO
title: Mulliken charges:
elementType: F F F O O N N C C C C C C C C C C C C C C C H H H H H H H H H
charge: -0.144318 -0.179781 -0.125716 -0.149649 -0.369284 -0.051209 -0.340530 0.281073 0.288342 0.209596 0.225667 -0.317838 -0.567066 -0.381382 -0.400399 0.223601 -0.415389 -0.365732 -0.215859 -0.232316 0.149891 0.304740 0.314454 0.251141 0.248405 0.281077 0.263497 0.233282 0.238442 0.358493 0.384766
chargesum: 0.00000
title: Mulliken charges with hydrogens summed into heavy atoms:
elementType: F F F O O N N C C C C C C C C C C C C C C C
charge: -0.144318 -0.179781 -0.125716 -0.149649 0.015482 -0.051209 0.017964 0.281073 0.288342 0.209596 0.225667 -0.317838 -0.252612 -0.130241 -0.151994 0.223601 -0.134312 -0.102235 0.017422 0.006126 0.149891 0.304740
polarizability: 3.64847889e+02 -1.01843440e+01 1.90757334e+02 -2.85783345e+00 -8.57497185e+00 9.20970351e+01
1716.lowfreq: -3.0320 -0.0003 -0.0001 0.0007 3.3995 6.6249 24.6632 34.6811 41.8253
frequency: 24.6512 34.6793 41.8209 65.9537 92.7657 129.9918 131.6780 151.0208 158.7461 174.5554 195.4564 223.7920 251.8358 271.4261 288.3607 323.6965 349.0404 395.1406 403.2177 404.0834 436.6286 439.4673 458.2987 491.6593 508.4414 519.3414 552.6901 575.9151 586.6128 618.6967 636.4637 643.0848 667.9514 690.4799 715.7586 726.3864 739.0008 754.9666 785.1340 832.8334 836.7523 858.2022 900.7061 933.5563 954.6315 968.8564 970.4559 972.7962 989.1659 996.1119 998.5998 1027.3651 1053.0642 1072.6252 1095.9218 1112.6782 1140.3002 1168.9308 1185.3913 1212.3413 1235.3569 1275.0946 1293.7003 1320.4957 1335.4543 1347.2783 1388.2657 1421.6141 1444.8244 1445.8671 1457.1531 1476.2078 1584.0758 1597.7634 1601.3234 1618.4903 1632.4598 1645.5151 3130.8596 3131.4362 3141.4535 3143.9515 3153.7321 3169.0611 3169.7096 3486.3193 3522.0698
redmass: 8.3976 7.8011 10.0238 10.1271 7.0274 5.6479 4.0445 7.1380 9.5406 7.2604 6.9969 6.7571 4.5555 7.2976 7.3439 2.3347 3.0556 8.1760 7.1175 3.4442 3.3668 4.2148 8.2457 5.1766 6.8955 5.5429 4.1308 2.5954 4.0802 3.5659 7.5713 7.4953 9.4610 4.5818 5.7442 5.6911 6.8866 1.5257 2.8208 7.1231 3.0516 1.5024 1.5041 1.6438 4.0261 2.1000 2.5195 1.4414 9.9691 5.5895 1.3640 2.0877 4.8965 3.2148 2.2068 4.3222 1.7399 1.2369 1.9799 2.2374 3.3929 1.4766 1.6829 4.5805 1.4457 6.4212 3.6143 1.2389 2.6606 2.6338 3.5826 4.1081 7.5941 7.7648 7.2801 7.6361 10.1797 9.3413 1.0922 1.0865 1.0895 1.0900 1.0949 1.0993 1.0967 1.0687 1.0775
irintensity: 2.2060 0.7434 0.2289 1.7811 2.1485 1.3678 1.0525 0.5528 0.4650 0.3347 1.2992 1.5098 12.7521 17.5966 24.5193 46.3455 27.2695 7.6269 2.5937 6.2830 8.6109 4.4729 8.0035 23.0808 10.3250 9.7348 45.2468 93.8731 4.4007 67.1942 20.0286 36.5295 19.1332 2.1406 17.0222 12.5916 19.5038 67.6712 31.8146 10.9304 2.6936 30.3784 0.1785 11.8228 35.6696 11.9729 19.6741 4.7441 183.1062 31.0639 0.3342 4.8900 212.1738 36.8493 83.1406 125.5525 31.4816 3.7401 1.7499 104.6528 39.4731 20.6759 19.8371 97.8394 118.9845 15.7884 7.3371 15.4747 15.2158 67.4120 101.3734 1.2917 20.9216 146.3698 44.5116 16.8074 134.0766 188.0986 5.7486 1.9360 5.1430 5.4175 14.4175 31.2858 8.9436 60.6148 16.0698
temp: 298.150 k
press: 1.00000 atm
elementType: 9 9 9 8 8 7 7 6 6 6 6 6 6 6 6 6 6 6 6 6 6 6 1 1 1 1 1 1 1 1 1
symmnumber: 1
zpe: 550938.4 jmol-1
zpe.correction: 0.209841 hartree
zpe.thermalcorrener: 0.228274 hartree
zpe.thermalcorrenthalpy: 0.229218 hartree
zpe.thermalcorrgfe: 0.161885 hartree
zpe.sumelectzpe: -1134.884803 hartree
zpe.sumelectthermal: -1134.866370 hartree
zpe.sumelectthermalent: -1134.865426 hartree
zpe.sumelectthermalfe: -1134.932759 hartree
dipole: 3.7483 -2.2820 3.6826
dipole: 5.7288
quadrupole: -112.3981 -126.1851 -124.9408
quadrupole: -11.6605 -7.4722 1.6226
quadrupole: 8.7766 -5.0104 -3.7661 -11.6605 -7.4722 1.6226
hfenergy: -1135.0946442 hartree
pointgroup: C01 [X(C15H9F3N2O2)]
dipole: 1.4653729 1.5179935 -0.7926828 debye
polarizability: 364.7097343|8.6233213|173.0821767|7.7706009|38.9527949|109.9103471 unknown
InChI: InChI=1S/C15H9F3N2O2/c16-15(17,18)14(20-22)19-8-5-6-10-9-3-1-2-4-11(9)13(21)12(10)7-8/h1-7,20,22H
charge 0 multiplicity 1
31 atoms
F  -5.172638 -1.229851 0.555253
F  -5.653587 0.55121 -0.780263
F  -5.055786 0.868755 1.379115
O  1.882698 -2.536328 -0.819928
O  -3.936823 -1.127322 -2.182171
N  -2.459232 0.654013 0.68139
N  -3.080041 -0.155557 -1.516758
C  1.775402 0.886992 0.31608
C  3.233694 0.6753 0.123271
C  1.094186 -0.320609 -0.023149
C  3.441218 -0.66327 -0.331907
C  2.110776 -1.353326 -0.445967
C  -0.296383 -0.442455 0.054245
C  1.035258 1.995324 0.766626
C  4.332421 1.531833 0.311176
C  -1.053338 0.690588 0.492868
C  4.724831 -1.15967 -0.603947
C  -0.372557 1.885052 0.863241
C  5.634771 1.032759 0.038345
C  5.83362 -0.294945 -0.413436
C  -3.311964 0.172974 -0.179405
C  -4.780818 0.093961 0.25548
H  -0.775252 -1.403467 -0.169404
H  1.525799 2.931294 1.053729
H  4.200962 2.562001 0.659318
H  4.856354 -2.189485 -0.951872
H  -0.974894 2.720238 1.233547
H  6.501919 1.687345 0.180455
H  6.84884 -0.652392 -0.614827
H  -2.113707 -0.249236 -1.84441
H  -4.62723 -0.574726 -2.6433
