program: Gaussian 09
title: 000268068
version: EM64L-G09RevD.01
frameworkgroup: C1[X(C20H24O9S2)]
method: RPBEPBE
basis: SDD
operation: Freq
keyword: #p
keyword: freq=noraman
keyword: PBEPBE/SDD
title: #p freq=noraman PBEPBE/SDD
converged: YES YES NO NO
title: Mulliken charges:
elementType: S S O O O O O O O O O C C C C C C C C C C C C C C C C C C C C H H H H H H H H H H H H H H H H H H H H H H H H
charge: 0.095044 0.032347 -0.213469 -0.262969 -0.294345 -0.257356 -0.259148 -0.235985 -0.220864 -0.250873 -0.251901 -0.105342 -0.037322 -0.006856 -0.052443 -0.516236 -0.388470 0.320051 0.305374 0.337360 -0.774581 -0.758453 0.324329 -0.759533 -0.181990 -0.747556 -0.190232 -0.246231 -0.228236 -0.208815 -0.236111 0.276068 0.321245 0.314434 0.229523 0.291495 0.265618 0.243310 0.279330 0.243632 0.249044 0.253693 0.248572 0.246909 0.256544 0.246265 0.257441 0.257579 0.254775 0.244284 0.305711 0.251271 0.275953 0.229138 0.228979
chargesum: 0.00000
title: Mulliken charges with hydrogens summed into heavy atoms:
elementType: S S O O O O O O O O O C C C C C C C C C C C C C C C C C C C C
charge: 0.095044 0.032347 -0.213469 -0.262969 -0.294345 -0.257356 -0.259148 -0.235985 -0.220864 -0.250873 -0.251901 0.170726 0.283922 0.307578 0.177080 -0.224741 0.120459 0.320051 0.305374 0.337360 -0.002575 -0.009278 0.324329 0.000717 -0.181990 0.009082 0.115479 0.005040 0.047717 0.020323 -0.007133
polarizability: 3.88448063e+02 -1.29972219e+01 2.61637729e+02 4.23624190e+00 1.31159409e+01 2.20497714e+02
1716.lowfreq: -8.0073 -5.4417 -2.6131 -0.0014 -0.0007 0.0016 16.2519 22.6122 24.6241
frequency: 16.0655 22.5195 24.4168 29.0406 32.9224 35.1394 37.9607 42.4045 44.8329 51.0910 55.4605 56.9619 60.8037 68.9780 76.0123 83.3716 85.6423 87.9293 100.4120 115.4628 124.4676 145.0644 155.6802 164.4593 187.1194 188.9379 207.8503 217.5523 227.6449 256.2390 261.6872 273.3417 284.3045 305.8963 332.8142 367.8632 385.1285 389.0183 402.7435 405.0103 421.1282 421.8592 459.5109 476.3649 484.7289 501.0159 550.4566 553.6519 557.7232 560.6885 586.1292 597.5408 606.6351 607.7279 626.4991 648.6671 665.4716 673.8037 676.3260 695.2051 760.4419 766.9665 779.6092 828.5618 834.7404 842.2377 858.6109 870.3812 901.0446 916.8092 929.8325 932.1717 967.0627 972.7110 981.2739 982.9602 992.9676 997.9532 1000.6415 1001.6037 1011.7886 1016.0064 1024.0951 1029.7949 1040.1437 1044.2044 1044.6916 1045.4426 1059.0064 1061.9638 1069.9594 1077.2481 1133.1711 1146.1606 1171.0930 1177.5188 1182.1656 1185.4427 1192.3918 1200.3749 1211.1777 1227.5237 1254.3807 1266.0487 1272.8485 1283.9923 1305.5544 1319.4088 1327.7978 1341.5335 1343.9154 1364.9362 1370.1001 1376.4438 1382.5921 1384.3645 1384.9826 1385.8161 1425.2958 1449.8175 1451.0027 1452.3582 1452.7787 1453.4024 1453.7434 1454.5720 1455.2020 1456.6636 1457.1822 1580.4232 1583.0081 1659.6100 1660.9903 1663.4704 1675.6073 2936.4159 2987.6863 3003.6924 3007.5366 3008.0293 3008.5727 3010.6760 3036.3921 3054.7993 3080.6836 3096.6946 3098.5469 3099.1505 3101.7539 3110.1227 3127.4861 3141.4128 3141.8024 3143.5414 3144.2210 3144.8872 3156.0651 3159.8128 3175.7852
redmass: 5.1088 5.7652 4.5595 1.9097 2.7051 1.6336 2.5233 5.4312 3.7504 4.8178 2.0445 6.7859 4.9016 2.5799 4.3971 1.6894 4.6792 4.3053 5.6693 7.2165 1.0484 7.2237 6.6538 5.8292 7.4589 6.9805 6.4049 7.3804 5.5922 7.2459 6.6898 7.8595 6.7261 3.8471 3.5171 3.9109 7.8279 4.8995 3.9926 3.5559 5.5187 4.2439 3.8956 4.1392 3.7531 4.6212 3.1880 3.2687 3.2619 3.2316 5.5870 5.2184 4.6540 6.4273 4.8932 4.5534 5.9108 6.8522 5.3242 2.3048 1.4653 4.0175 5.5839 5.8731 4.7237 4.5636 1.2354 4.6722 6.8952 4.6285 1.3575 3.9436 3.8799 2.8562 1.4837 4.5509 2.1397 1.9824 3.2094 2.0204 3.6785 1.3184 3.4889 3.2683 1.6680 1.6560 1.6929 1.6676 2.7670 2.3475 3.8119 1.6038 2.2207 2.7498 1.0589 3.0138 2.8529 1.3917 2.2105 2.0744 1.6275 1.5588 1.1710 1.3005 1.2641 1.2852 1.3159 1.2238 1.3620 1.2740 1.5620 1.3745 1.4642 9.0755 1.2522 1.2499 1.2455 1.2546 2.1206 1.0874 1.0575 1.0576 1.0523 1.0583 1.0596 1.0647 1.0572 1.9244 1.0551 5.9875 6.0288 9.2051 9.6154 9.9673 9.9322 1.0820 1.0845 1.0383 1.0383 1.0374 1.0370 1.0833 1.0580 1.0854 1.0849 1.0971 1.0963 1.0939 1.0939 1.1068 1.0854 1.1026 1.0906 1.1027 1.1011 1.1015 1.0915 1.0974 1.0998
irintensity: 0.2011 0.1895 0.2653 3.1389 0.1013 0.2900 0.3475 0.0657 0.0559 0.1410 4.9879 0.7753 1.2305 0.2680 2.1851 0.6634 2.5605 11.6388 0.2854 2.2608 0.3167 4.1540 0.3380 4.9435 8.0895 1.5703 1.3358 3.8443 4.1719 4.9227 1.4298 4.8145 3.1118 2.1088 18.2158 9.5419 4.0219 3.2275 3.8842 3.5512 0.8880 5.2071 23.8393 4.5266 10.6828 8.2132 4.7827 4.6182 14.0381 1.2590 11.4921 3.9545 7.3415 0.4026 8.9982 24.0551 21.4009 4.0847 4.1781 27.7255 66.7898 15.9103 35.0316 61.1024 7.9580 32.9797 0.1212 18.8753 62.4454 77.8355 2.3657 78.8172 5.5718 23.7896 0.4448 3.2082 41.2798 88.6473 225.8706 18.8534 14.1444 0.7565 60.2589 49.5895 15.6611 7.5502 22.4408 12.6222 75.1311 2.2469 59.3999 6.7481 1.9373 17.7690 5.1891 164.7190 303.5756 61.9894 435.0334 194.8072 171.4112 26.9677 2.1953 18.5684 10.0368 16.3422 0.9693 5.1876 3.7966 4.7943 8.0564 4.0785 13.8377 1.5326 61.9619 2.4243 107.3735 75.1201 24.5387 27.7834 34.2443 20.4799 3.9708 25.1982 28.1605 11.2103 22.1190 19.0609 14.6913 0.4195 2.7090 248.0502 195.1994 101.6587 182.2561 31.4046 12.0708 1.3148 0.9755 0.6748 1.9087 10.5135 24.1829 7.8118 7.9891 6.6759 4.9629 5.3129 8.3392 6.8481 2.8124 8.9329 12.9546 7.6260 9.4175 9.6265 17.1470 11.0891 25.9923
temp: 298.150 k
press: 1.00000 atm
elementType: 16 16 8 8 8 8 8 8 8 8 8 6 6 6 6 6 6 6 6 6 6 6 6 6 6 6 6 6 6 6 6 1 1 1 1 1 1 1 1 1 1 1 1 1 1 1 1 1 1 1 1 1 1 1 1
symmnumber: 1
zpe: 1084875.0 jmol-1
zpe.correction: 0.413207 hartree
zpe.thermalcorrener: 0.447675 hartree
zpe.thermalcorrenthalpy: 0.448619 hartree
zpe.thermalcorrgfe: 0.339865 hartree
zpe.sumelectzpe: -2247.340026 hartree
zpe.sumelectthermal: -2247.305558 hartree
zpe.sumelectthermalent: -2247.304614 hartree
zpe.sumelectthermalfe: -2247.413368 hartree
dipole: 1.7957 3.5659 0.4986
dipole: 4.0235
quadrupole: -182.4041 -199.8222 -184.3336
quadrupole: 7.5964 -2.8532 -8.9929
quadrupole: 6.4492 -10.9689 4.5197 7.5964 -2.8532 -8.9929
hfenergy: -2247.7532326 hartree
pointgroup: C01 [X(C20H24O9S2)]
dipole: 0.5225693 -1.3694203 -0.5978729 debye
polarizability: 386.7718898|5.8102993|252.1139939|-21.6980566|20.4495008|231.697622 unknown
InChI: InChI=1S/C20H24O9S2/c1-11(21)25-10-16-17(26-12(2)22)18(27-13(3)23)19(28-14(4)24)20(29-16)31-30-15-8-6-5-7-9-15/h5-9,16-20H,10H2,1-4H3
charge 0 multiplicity 1
55 atoms
S  -1.371588 2.445523 0.466593
S  -2.819398 2.251933 2.230009
O  -0.663306 -0.195109 0.469726
O  3.471105 0.480595 -0.090385
O  2.50864 -2.176521 0.59998
O  1.043539 1.597735 -1.111792
O  -0.517669 -2.677138 -1.08306
O  4.240485 1.659987 1.773709
O  3.231244 -2.572705 -1.596872
O  2.71016 3.241329 -1.151231
O  -2.850472 -2.530112 -1.027996
C  2.199544 0.247423 0.621107
C  1.617564 -1.085638 0.14055
C  1.227238 1.420682 0.351338
C  0.243419 -1.309932 0.817188
C  -0.154498 1.100313 0.945542
C  -0.450174 -2.603004 0.394918
C  4.417898 1.279232 0.597909
C  3.297002 -2.828375 -0.380249
C  1.863893 2.548163 -1.753442
C  5.585395 1.593869 -0.298802
C  4.194303 -3.842998 0.291218
C  -1.786121 -2.574566 -1.680605
C  1.553999 2.571138 -3.230306
C  -4.219015 1.287886 1.516589
C  -1.646704 -2.513498 -3.183172
C  -4.01716 0.071935 0.823661
C  -5.525264 1.784028 1.752196
C  -5.136632 -0.657885 0.366609
C  -6.639982 1.03016 1.316599
C  -6.44757 -0.186648 0.621706
H  2.401047 0.211635 1.710484
H  1.524687 -1.113096 -0.958405
H  1.638452 2.351654 0.781635
H  0.390976 -1.346522 1.921662
H  -0.090067 1.095155 2.052744
H  -1.471168 -2.6450 0.812325
H  0.1418 -3.47298 0.720628
H  5.313216 2.474247 -0.910378
H  6.469886 1.842727 0.306133
H  5.799552 0.757366 -0.982182
H  4.92356 -3.325242 0.938895
H  4.729901 -4.426704 -0.470891
H  3.603414 -4.515335 0.935975
H  0.464815 2.617497 -3.394124
H  2.04834 3.433029 -3.700665
H  1.920616 1.639424 -3.697441
H  -1.457815 -1.465789 -3.481083
H  -0.793768 -3.119934 -3.524824
H  -2.580237 -2.848948 -3.658746
H  -3.003459 -0.288065 0.622793
H  -5.666363 2.743435 2.261543
H  -4.965235 -1.587792 -0.184124
H  -7.652023 1.405551 1.504976
H  -7.313802 -0.759412 0.271532
