program: Gaussian 09
title: 000267866
version: EM64L-G09RevD.01
frameworkgroup: C1[X(C17H17ClNO4P)]
method: RPBEPBE
basis: SDD
operation: Freq
keyword: #p
keyword: freq=noraman
keyword: PBEPBE/SDD
title: #p freq=noraman PBEPBE/SDD
converged: YES YES NO NO
title: Mulliken charges:
elementType: Cl P O O O O N C C C C C C C C C C C C C C C C C H H H H H H H H H H H H H H H H H
charge: -0.047239 1.387451 -0.485347 -0.540959 -0.145189 -0.571274 -0.899706 0.315223 0.233070 0.280926 0.216840 -0.311648 -0.553100 0.739718 -0.419711 -0.409910 -0.394130 -0.416046 -0.217149 -0.232446 -0.241111 -0.256710 -0.656245 -0.650988 0.322982 0.269776 0.245910 0.366302 0.280553 0.231526 0.236924 0.225914 0.236182 0.243521 0.227816 0.214619 0.230318 0.242849 0.219800 0.225018 0.255672
chargesum: 0.00000
title: Mulliken charges with hydrogens summed into heavy atoms:
elementType: Cl P O O O O N C C C C C C C C C C C C C C C C C
charge: -0.047239 1.387451 -0.485347 -0.540959 -0.145189 -0.571274 -0.533405 0.315223 0.233070 0.280926 0.216840 -0.311648 -0.230118 0.739718 -0.149935 -0.409910 -0.148220 -0.135494 0.014377 0.004478 0.220986 0.214627 0.031541 0.049501
polarizability: 4.01040258e+02 1.96813415e+01 2.43391266e+02 -1.04400461e+01 9.23257030e+00 1.40453837e+02
1716.lowfreq: -11.4224 -5.1217 0.0005 0.0014 0.0017 4.3947 11.4788 22.7177 25.9889
frequency: 5.9907 21.9009 25.8794 39.1061 49.2020 64.5249 72.5416 78.1960 93.5852 132.3030 138.4704 148.7833 154.9684 164.5331 179.3752 204.2609 221.3350 236.1763 252.6311 261.2055 262.7332 301.7693 320.6352 337.1775 362.1803 390.1310 419.8070 427.5176 431.7519 433.1203 441.1664 490.8942 496.6472 531.2369 572.4542 593.1306 602.9395 612.8489 630.2713 656.9186 670.9823 704.7179 719.0989 743.4082 750.1939 778.1330 800.9716 803.1607 817.6206 828.6488 858.6235 863.4785 875.9942 883.0494 896.5699 921.8954 968.1139 987.6830 996.3605 1003.9046 1011.6692 1019.2652 1031.8401 1066.9098 1079.4707 1091.6683 1094.5355 1118.4305 1140.6704 1145.4979 1166.1107 1185.4391 1195.4743 1238.4543 1268.6161 1273.1168 1281.2240 1300.0713 1329.7204 1349.6675 1356.4759 1382.2362 1388.9253 1394.4818 1405.5650 1443.7271 1448.3731 1457.8972 1460.5772 1461.6932 1465.5079 1467.9592 1479.1168 1484.8748 1487.3275 1584.1555 1599.5906 1604.7406 1626.0099 1640.5960 2988.2371 2988.7235 3003.1128 3015.7822 3078.4984 3080.6957 3084.6724 3088.0767 3109.9675 3111.1621 3129.2377 3141.7904 3142.0551 3152.1951 3161.1524 3167.8340 3505.5047
redmass: 3.1072 5.4403 4.0491 3.9492 3.4962 3.8307 4.1695 6.2342 4.4879 5.7719 5.8229 5.6366 5.5952 3.0607 5.9291 1.8728 5.8381 2.3698 1.8591 3.8994 2.3194 8.4374 5.4046 6.1698 5.2113 4.4245 3.7963 4.7289 3.6524 3.1681 7.5595 4.2806 5.4969 6.7313 2.9510 4.3216 4.0492 4.9973 2.6902 6.2061 7.5121 4.6200 6.5462 5.8248 1.6702 2.2957 1.1264 1.1203 7.0075 2.7261 3.5986 4.0533 5.0522 1.4484 1.5410 1.8338 1.4714 3.5557 1.3606 4.6675 2.9307 3.1157 2.2229 13.1232 2.6029 2.2249 2.1571 2.5036 1.5260 1.5702 1.3144 2.0063 2.2550 1.4331 1.1207 1.1143 1.7103 2.1015 3.2935 1.2207 1.2309 3.9505 1.2351 1.2267 2.1855 3.4047 2.6916 1.0781 1.3127 1.4734 1.0656 1.4117 1.0600 4.3722 1.0544 7.9708 7.1402 8.1841 7.9432 10.5673 1.0360 1.0362 1.0624 1.0615 1.1022 1.1010 1.0975 1.0987 1.1032 1.1049 1.0863 1.0902 1.0929 1.0947 1.0931 1.1003 1.0750
irintensity: 1.0438 1.1327 0.6695 0.6349 0.9748 3.0855 0.7828 0.1270 2.1416 0.1844 0.9226 4.4565 2.3752 5.3313 0.1964 8.0110 0.0022 4.2091 10.2518 0.6439 1.3355 14.8209 28.6772 8.9237 2.0677 9.0267 7.3564 5.7850 7.5838 2.2493 3.9851 11.5436 55.1739 3.5298 29.1989 18.7385 17.2079 88.5141 85.4110 27.6911 57.6853 28.1037 36.3223 52.2205 43.9163 43.1874 4.6503 5.6376 52.3583 0.6149 305.7138 102.1007 115.1274 16.6538 2.7639 27.4608 5.8789 37.0280 0.0917 14.8357 135.7779 195.9549 3.7399 153.8158 19.7968 7.6223 6.1711 10.7196 4.5412 7.5866 8.4715 18.6471 13.9415 1.9652 1.1507 0.4645 11.3052 66.5508 190.6066 8.4587 13.9754 42.7766 24.2867 34.8476 0.7770 5.3908 127.0717 34.2691 120.3385 130.1403 8.3120 144.9847 27.2092 99.6057 6.6017 51.8919 59.5204 177.3694 46.1297 76.9603 3.4715 31.7565 28.3767 31.4814 2.2172 21.5562 37.7050 13.5424 25.6912 32.1599 3.1793 2.4687 8.1549 13.3562 1.3533 33.9527 77.5877
temp: 298.150 k
press: 1.00000 atm
elementType: 17 15 8 8 8 8 7 6 6 6 6 6 6 6 6 6 6 6 6 6 6 6 6 6 1 1 1 1 1 1 1 1 1 1 1 1 1 1 1 1 1
symmnumber: 1
zpe: 805740.5 jmol-1
zpe.correction: 0.306890 hartree
zpe.thermalcorrener: 0.330871 hartree
zpe.thermalcorrenthalpy: 0.331816 hartree
zpe.thermalcorrgfe: 0.249310 hartree
zpe.sumelectzpe: -1813.214373 hartree
zpe.sumelectthermal: -1813.190392 hartree
zpe.sumelectthermalent: -1813.189448 hartree
zpe.sumelectthermalfe: -1813.271954 hartree
dipole: 0.3499 4.2468 3.4797
dipole: 5.5015
quadrupole: -109.4035 -164.2140 -157.4008
quadrupole: -2.9412 2.9434 -6.7532
quadrupole: 34.2693 -20.5412 -13.7280 -2.9412 2.9434 -6.7532
hfenergy: -1813.5212636 hartree
pointgroup: C01 [X(C17H17Cl1N1O4P1)]
dipole: -0.1403487 1.1048791 -1.8559038 debye
polarizability: 401.1282625|-21.7099566|225.4698392|-3.0915572|-40.0369192|158.2872598 unknown
InChI: InChI=1S/C17H17ClNO4P/c1-3-22-24(21,23-4-2)19-16-10-14-13(9-15(16)18)11-7-5-6-8-12(11)17(14)20/h5-10,19H,3-4H2,1-2H3
charge 0 multiplicity 1
41 atoms
Cl -0.750434 3.537739 -1.407405
P  -3.207222 0.040256 0.605253
O  -3.041932 -1.456308 -0.240984
O  -4.606051 0.892406 0.032457
O  2.027422 -2.3387 1.285755
O  -3.14625 -0.215382 2.167388
N  -2.079335 1.134551 -0.157953
C  2.172438 0.903691 -0.285545
C  1.40111 -0.15466 0.280306
C  3.611011 0.545834 -0.1986
C  3.717169 -0.738563 0.418264
C  2.33811 -1.242679 0.746212
C  0.005853 -0.114864 0.348045
C  -0.678445 1.025234 -0.175313
C  1.520762 2.035861 -0.800068
C  0.11251 2.069856 -0.734915
C  4.770494 1.230472 -0.601844
C  4.960284 -1.350477 0.637446
C  6.032015 0.614236 -0.380881
C  6.131032 -0.659695 0.230147
C  -2.900655 -1.516025 -1.727935
C  -5.830642 0.851605 0.894093
C  -4.257061 -1.47866 -2.434861
C  -6.546323 -0.498471 0.813375
H  -0.548278 -0.944863 0.800648
H  2.064641 2.875558 -1.241981
H  4.717042 2.216645 -1.07597
H  -2.488037 2.002131 -0.521071
H  5.013787 -2.335778 1.112161
H  6.945686 1.134823 -0.689122
H  7.116686 -1.110037 0.387733
H  -2.238453 -0.697066 -2.069052
H  -2.385756 -2.479074 -1.881076
H  -5.539223 1.089708 1.933946
H  -6.442114 1.671595 0.483833
H  -4.112107 -1.633087 -3.520866
H  -4.912827 -2.281835 -2.056915
H  -4.760227 -0.50861 -2.282796
H  -7.484338 -0.454976 1.397933
H  -6.798973 -0.752229 -0.230402
H  -5.921264 -1.305161 1.235062
