program: Gaussian 09
title: 000267821
version: EM64L-G09RevD.01
frameworkgroup: C1[X(C15H13N5O)]
method: RPBEPBE
basis: SDD
operation: Freq
keyword: #p
keyword: freq=noraman
keyword: PBEPBE/SDD
title: #p freq=noraman PBEPBE/SDD
converged: YES YES NO NO
title: Mulliken charges:
elementType: O N N N N N C C C C C C C C C C C C C C C H H H H H H H H H H H H H
charge: -0.356324 -0.397159 -0.148764 -0.101061 -0.083076 -0.582248 0.233616 0.161166 -0.298642 -0.327691 0.369039 -0.242947 -0.236749 0.094725 -0.359354 -0.387681 -0.204056 -0.194114 -0.250012 0.089519 -0.317433 0.306619 0.266297 0.370409 0.224885 0.229384 0.270771 0.259500 0.229809 0.231252 0.231463 0.247435 0.340262 0.331160
chargesum: 0.00000
title: Mulliken charges with hydrogens summed into heavy atoms:
elementType: O N N N N N C C C C C C C C C C C C C C C
charge: -0.356324 -0.026750 -0.148764 -0.101061 -0.083076 0.089174 0.233616 0.161166 0.007976 -0.061395 0.369039 -0.018061 -0.007365 0.094725 -0.088583 -0.128182 0.025753 0.037139 -0.018549 0.089519 -0.069998
polarizability: 3.18092805e+02 2.03283557e+00 2.23449047e+02 4.11624460e+00 1.60276249e+01 1.12635163e+02
1716.lowfreq: -8.7473 -3.5251 -0.0003 0.0007 0.0010 7.2178 19.6700 33.6499 41.2922
frequency: 19.1480 33.6087 41.2575 60.4823 75.0944 107.1171 153.7566 160.0358 191.7551 216.7815 225.2069 286.7324 301.1754 328.8818 396.2117 410.6871 414.1461 446.5868 450.7187 482.3069 503.7637 544.6578 556.2573 566.7024 568.3934 591.5606 604.4772 619.0777 671.8048 691.1674 702.2169 721.8010 743.0752 756.3270 769.3904 775.1747 779.2550 812.1284 835.0175 843.8778 869.9564 873.9256 908.7447 914.3642 945.5394 947.0500 963.5399 970.1530 986.6427 987.3195 988.7160 1020.1177 1033.1777 1064.1469 1078.5322 1103.8858 1156.1495 1169.7038 1170.1585 1176.7938 1188.1029 1202.1243 1248.2030 1261.3040 1298.1267 1308.8798 1323.7661 1377.2294 1386.5544 1406.8122 1441.5044 1444.3062 1457.8575 1471.4713 1483.4791 1488.9891 1523.3710 1553.0904 1595.6210 1596.5090 1608.7377 1612.4254 1623.2469 3132.7997 3136.0986 3142.1218 3151.8751 3158.0389 3159.7669 3166.3601 3169.2375 3175.6682 3192.9560 3488.7155 3553.2544 3712.6303
redmass: 5.9226 4.4910 4.8995 5.3121 5.4685 5.1555 5.9150 6.3340 6.9404 6.1552 4.9578 6.9599 4.7791 5.0390 5.1231 2.9259 3.6955 2.7251 3.3285 3.2790 1.3076 4.0103 1.0435 8.1078 8.0752 6.5410 5.9358 6.5105 6.8327 2.3326 6.0561 4.9977 2.8744 1.2840 1.8756 5.2173 2.1643 2.7733 1.3101 4.9718 1.6307 3.4593 1.4083 10.5459 2.6296 1.3650 1.4473 1.3614 5.7398 1.3026 1.3157 2.1144 2.0870 2.6663 1.5037 2.4996 1.7666 1.0643 1.1014 1.3169 5.1934 3.0263 2.5013 3.2411 2.0128 1.3911 2.0450 2.5906 5.4380 3.0511 2.3299 2.6619 3.3984 2.3898 2.7746 2.5867 5.5920 2.8454 6.3627 4.7089 6.5229 3.3662 2.7585 1.0850 1.0860 1.0892 1.0915 1.0930 1.0932 1.0964 1.0982 1.1007 1.0949 1.0749 1.0444 1.1058
irintensity: 1.4881 0.7926 0.3003 0.6400 0.4136 0.2677 1.5549 1.8424 5.2862 1.3604 2.1048 3.6619 1.7572 12.8281 1.5118 0.8704 1.9889 23.6995 30.2852 15.9285 239.8445 2.2837 15.7925 4.1784 1.2277 16.9878 2.1121 0.1922 2.0657 22.9206 7.4302 3.5971 26.4135 95.5873 37.9674 4.3090 18.2810 104.0137 3.3555 52.2870 3.7239 9.7039 5.7730 20.6999 0.1534 5.7492 9.3397 0.2671 1.2475 1.7956 0.8989 14.8547 17.4915 12.0418 13.0518 16.5973 21.1236 2.4192 2.6609 49.8303 3.0279 404.8027 87.8858 42.2326 1.0063 8.6645 78.2886 23.2969 10.0547 72.3332 37.2048 257.3162 163.4089 260.2299 114.7371 26.2355 1080.4842 621.9145 33.1429 42.4901 31.2575 176.5573 266.7932 1.8492 1.2654 10.9472 26.0166 24.6461 25.7146 10.3024 13.4028 8.4707 12.7103 115.5391 113.0137 49.9447
temp: 298.150 k
press: 1.00000 atm
elementType: 8 7 7 7 7 7 6 6 6 6 6 6 6 6 6 6 6 6 6 6 6 1 1 1 1 1 1 1 1 1 1 1 1 1
symmnumber: 1
zpe: 682036.9 jmol-1
zpe.correction: 0.259774 hartree
zpe.thermalcorrener: 0.276814 hartree
zpe.thermalcorrenthalpy: 0.277758 hartree
zpe.thermalcorrgfe: 0.212843 hartree
zpe.sumelectzpe: -926.934912 hartree
zpe.sumelectthermal: -926.917873 hartree
zpe.sumelectthermalent: -926.916928 hartree
zpe.sumelectthermalfe: -926.981843 hartree
dipole: -0.7194 2.4732 0.8626
dipole: 2.7163
quadrupole: -94.3339 -116.1280 -122.2758
quadrupole: 13.6126 1.1227 4.3357
quadrupole: 16.5787 -5.2154 -11.3632 13.6126 1.1227 4.3357
hfenergy: -927.1946865 hartree
pointgroup: C01 [X(C15H13N5O1)]
dipole: -0.3134309 0.8544608 0.5600964 debye
polarizability: 317.6652047|7.8096331|211.0813489|-2.9246573|38.8375045|125.4304606 unknown
InChI: InChI=1S/C15H13N5O/c16-14-17-10-18-15(20-14)19-12-8-4-5-9-13(12)21-11-6-2-1-3-7-11/h1-10,19H,16H2
charge 0 multiplicity 1
34 atoms
O  -1.562566 -0.201401 -0.562272
N  1.060687 -0.235028 -0.238763
N  3.362843 0.284513 0.162712
N  2.614589 -1.904899 -0.629792
N  4.986678 -1.504234 -0.261139
N  5.659562 0.608222 0.497338
C  0.421927 0.979303 0.091612
C  -1.000143 0.995707 -0.040227
C  1.074007 2.160139 0.52989
C  -1.751662 2.151109 0.236177
C  -2.840811 -0.663387 -0.143711
C  0.317386 3.315908 0.821997
C  -1.088485 3.31984 0.676018
C  2.389149 -0.595322 -0.223343
C  -3.321352 -0.493625 1.174912
C  -3.574463 -1.391097 -1.104889
C  -4.567778 -1.060702 1.523138
C  -4.816057 -1.955521 -0.739144
C  -5.319913 -1.790252 0.572761
C  4.639713 -0.22368 0.123565
C  3.91973 -2.275179 -0.620428
H  2.159836 2.141875 0.631481
H  -2.837757 2.138631 0.103055
H  0.435197 -0.984983 -0.555632
H  0.834087 4.220196 1.161064
H  -1.668603 4.222694 0.892654
H  -2.732531 0.058413 1.913746
H  -3.165121 -1.506363 -2.112933
H  -4.945189 -0.936995 2.544227
H  -5.389413 -2.522152 -1.480835
H  -6.284152 -2.227505 0.852046
H  4.142675 -3.299839 -0.933633
H  6.612396 0.253258 0.475144
H  5.452429 1.560352 0.787602
