program: Gaussian 09
title: 000267961
version: EM64L-G09RevD.01
frameworkgroup: C1[X(C20H28O6P2S3)]
method: RPBEPBE
basis: SDD
operation: Freq
keyword: #p
keyword: freq=noraman
keyword: PBEPBE/SDD
title: #p freq=noraman PBEPBE/SDD
converged: NO YES NO NO
title: Mulliken charges:
elementType: S S S P P O O O O O O C C C C C C C C C C C C C C C C C C C C H H H H H H H H H H H H H H H H H H H H H H H H H H H H
charge: 0.252824 -0.248547 -0.253337 0.895966 0.896865 -0.511584 -0.512328 -0.457542 -0.461931 -0.457950 -0.462862 0.382797 0.373713 -0.248804 -0.228553 -0.357870 -0.358154 -0.346310 -0.351423 -0.230726 -0.235141 -0.154677 -0.123203 -0.255692 -0.217460 -0.254800 -0.216950 -0.641553 -0.654096 -0.639549 -0.654355 0.264415 0.263187 0.279683 0.272884 0.260310 0.252987 0.262292 0.257577 0.235519 0.238035 0.225760 0.237972 0.234473 0.236998 0.224286 0.238066 0.241164 0.231415 0.220659 0.235085 0.237201 0.211026 0.239718 0.232908 0.217172 0.234798 0.237275 0.210367
chargesum: 0.00000
title: Mulliken charges with hydrogens summed into heavy atoms:
elementType: S S S P P O O O O O O C C C C C C C C C C C C C C C C C C C C
charge: 0.252824 -0.248547 -0.253337 0.895966 0.896865 -0.511584 -0.512328 -0.457542 -0.461931 -0.457950 -0.462862 0.382797 0.373713 -0.248804 -0.228553 -0.093455 -0.094967 -0.066627 -0.078539 0.029583 0.017846 0.107615 0.134374 0.217862 0.246272 0.216671 0.245402 0.051685 0.029217 0.050250 0.028084
polarizability: 4.65034628e+02 -2.16550373e+00 3.36681955e+02 -9.91399593e-01 -2.08321552e+00 2.68160242e+02
1716.lowfreq: -12.0606 -11.4629 -3.9586 -2.3323 -0.0012 -0.0008 0.0009 1.5502 9.5681
frequency: -10.9613 -6.9109 7.7887 9.8363 13.3440 19.6910 24.8121 26.6589 32.2772 37.6261 44.0076 46.7430 48.6934 52.8841 54.5003 60.7666 81.3626 95.4425 98.8897 116.6821 124.7346 152.3564 155.5346 157.2894 163.4900 201.8254 206.6246 216.4604 220.2108 228.0070 234.6073 236.6781 246.1549 257.7823 265.6797 285.9684 295.8799 298.5930 309.1570 357.9156 364.4997 373.7239 389.9129 395.8580 404.6735 408.1353 409.2884 411.4315 413.1948 422.6626 433.5195 472.1677 481.5065 518.7569 536.3022 582.3039 587.6281 623.7371 625.8750 672.8739 675.1811 677.5819 680.3072 705.4670 709.6786 712.0788 716.4757 795.4905 796.3197 812.9848 813.2234 819.3048 821.5968 825.3093 831.3437 836.8658 843.5275 864.7182 865.8876 882.0515 883.7915 950.4394 955.5865 964.1896 969.5165 996.6377 1001.3508 1004.8468 1005.9756 1019.0197 1020.4933 1060.2186 1077.2550 1092.0253 1092.3639 1098.9131 1103.2826 1106.5188 1106.5556 1133.3891 1134.0645 1139.5668 1141.2446 1155.3669 1158.8246 1187.4377 1189.6001 1255.5381 1256.4803 1270.9627 1271.1343 1284.0234 1287.8862 1351.3285 1353.9138 1354.9633 1356.8665 1357.4911 1362.7321 1390.4471 1390.8363 1395.4971 1395.5900 1396.3505 1398.9538 1456.8803 1457.2196 1457.7633 1458.9395 1459.7464 1461.6408 1463.2522 1467.4500 1476.2429 1477.5432 1478.1767 1478.2640 1486.8012 1488.1421 1573.2726 1578.4193 1589.2078 1591.8753 2986.0823 2987.3859 2990.9384 2992.1038 2997.6796 2998.1389 3007.7325 3008.0512 3060.8335 3061.8499 3078.0500 3079.0689 3087.2587 3088.1040 3094.0450 3094.3389 3107.5909 3109.2482 3113.1758 3113.8714 3145.7196 3146.4119 3149.9062 3152.5315 3171.2698 3172.2335 3175.8900 3178.6173
redmass: 3.4530 4.1823 5.5478 4.5136 4.4765 4.4061 4.4258 3.7390 3.9691 3.5886 3.3009 2.7211 3.1814 5.7478 2.2149 2.2712 8.6954 4.7426 4.8061 6.9830 7.5975 3.1853 3.3234 5.9517 8.9051 3.3372 2.2521 1.9216 1.5617 3.8475 2.4475 1.4499 2.0744 5.0208 3.3697 4.0378 4.8148 4.9829 4.4067 6.5985 6.2598 6.7823 7.5579 5.9359 5.8722 3.6008 3.0610 3.3995 3.2075 5.5217 7.0511 7.8133 8.2375 3.3886 3.1094 9.0006 8.6588 7.2666 7.3225 7.5173 7.2840 9.4433 9.2678 4.2989 5.7910 5.4866 4.3895 1.1348 1.1259 1.1007 1.1046 6.0390 6.8223 1.2741 1.2616 1.5532 1.5678 4.3487 4.3078 4.0922 4.0595 1.3342 1.3325 1.3610 1.3604 4.2299 3.7222 2.5482 2.5652 2.6972 2.7377 2.7809 2.9315 2.2354 2.2244 1.3459 1.3395 2.2293 2.2211 1.4186 1.4150 1.5507 1.5516 1.8937 1.8925 1.7330 1.6450 1.1454 1.1439 1.1110 1.1114 1.2516 1.2512 5.1153 1.2096 1.2112 1.2616 1.2566 5.5779 1.2348 1.2576 2.4065 1.4868 1.2609 3.7227 1.0395 1.0396 1.0790 1.0514 1.0431 1.0738 2.2096 2.2143 1.0654 1.0567 1.0633 1.0596 1.0776 1.0789 7.5997 7.7565 6.3597 6.3640 1.0358 1.0361 1.0544 1.0539 1.0391 1.0397 1.0625 1.0623 1.1073 1.1074 1.1007 1.1008 1.0986 1.0986 1.0980 1.0980 1.1043 1.1040 1.1024 1.1024 1.0894 1.0891 1.0892 1.0894 1.0959 1.0966 1.0966 1.0969
irintensity: 0.9365 0.5442 0.1764 1.2039 0.0443 0.3885 0.3823 1.3119 1.5502 0.3925 1.4925 1.8728 1.3741 0.1558 1.3843 1.1475 0.2441 4.1180 0.7005 1.8759 3.4482 3.3480 3.2040 1.4003 6.1153 0.1648 0.8127 3.2955 4.0515 1.5143 9.1907 2.3348 2.8746 0.1805 12.4520 3.1502 6.2575 5.1459 9.3504 23.3859 14.3078 7.1787 11.2310 7.1649 9.3488 1.2516 4.5548 9.9039 3.5640 5.2263 12.6097 7.9121 1.5728 16.9777 64.3300 93.6882 1.6450 6.4157 1.2370 74.9466 89.1789 130.3090 155.2631 26.2375 14.6507 143.3967 4.8295 5.4470 4.8451 4.3080 4.5183 113.8039 133.4164 4.0578 5.6510 54.0940 46.1780 187.7021 285.2352 210.6439 95.6145 1.9930 1.7191 0.8602 0.1171 55.9087 20.4068 164.5019 200.4384 57.3176 48.1422 22.4619 1.8226 7.6402 8.4264 14.7250 6.9067 9.1185 5.2429 5.1331 5.3593 9.6358 7.6932 128.0640 87.7247 101.8696 68.8502 0.0681 0.0773 0.3022 0.1038 0.5479 0.3960 0.5590 11.5931 12.1384 5.2906 7.2158 1.8430 14.6320 26.7802 19.5725 17.0042 27.2485 3.1599 12.8628 12.1031 10.0638 12.4482 17.1997 11.7147 225.4912 82.4754 17.6000 6.4348 17.7582 13.1251 11.9060 11.6430 1.6953 0.0883 5.7359 20.2671 12.4494 12.3526 19.8817 19.8344 28.4584 26.7475 28.6894 28.9859 10.3438 10.3988 10.9838 12.1034 18.1822 21.5352 24.0934 24.4475 24.3932 23.7077 29.9285 30.3104 4.3571 5.4119 2.8393 3.3505 2.0105 1.3106 3.0464 2.2820
temp: 298.150 k
press: 1.00000 atm
elementType: 16 16 16 15 15 8 8 8 8 8 8 6 6 6 6 6 6 6 6 6 6 6 6 6 6 6 6 6 6 6 6 1 1 1 1 1 1 1 1 1 1 1 1 1 1 1 1 1 1 1 1 1 1 1 1 1 1 1 1
symmnumber: 1
zpe: 1177297.9 jmol-1
zpe.correction: 0.448409 hartree
zpe.thermalcorrener: 0.484574 hartree
zpe.thermalcorrenthalpy: 0.485518 hartree
zpe.thermalcorrgfe: 0.370956 hartree
zpe.sumelectzpe: -3104.529989 hartree
zpe.sumelectthermal: -3104.493824 hartree
zpe.sumelectthermalent: -3104.492880 hartree
zpe.sumelectthermalfe: -3104.607443 hartree
dipole: 0.2484 -0.3114 -0.1169
dipole: 0.4152
quadrupole: -203.2501 -228.2627 -207.7579
quadrupole: 2.0842 8.7143 3.1550
quadrupole: 9.8401 -15.1725 5.3323 2.0842 8.7143 3.1550
hfenergy: -3104.9783984 hartree
pointgroup: C01 [X(C20H28O6P2S3)]
dipole: 0.1022662 -0.117387 -0.0493975 debye
polarizability: 464.0080945|-2.0633244|336.4562365|14.2905089|4.2147939|269.4124941 unknown
InChI: InChI=1S/C20H28O6P2S3/c1-5-21-27(29,22-6-2)25-17-9-13-19(14-10-17)31-20-15-11-18(12-16-20)26-28(30,23-7-3)24-8-4/h9-16H,5-8H2,1-4H3
charge 0 multiplicity 1
59 atoms
S  0.021726 3.814031 0.381688
S  3.927557 -2.718307 1.421164
S  -3.564955 -2.816981 -0.85526
P  5.009151 -1.433987 0.210529
P  -4.956852 -1.410774 -0.244186
O  4.955593 0.284967 0.604298
O  -4.739633 0.24044 -0.821427
O  4.698342 -1.461788 -1.478897
O  6.713543 -1.590984 0.169969
O  -5.213616 -1.215942 1.444419
O  -6.5869 -1.601675 -0.733107
C  3.754604 1.041881 0.539336
C  -3.579991 1.002752 -0.508872
C  1.471573 2.674855 0.425426
C  -1.367673 2.646529 0.042736
C  3.714075 2.112342 -0.379256
C  -3.740128 2.118696 0.340067
C  2.669455 0.777503 1.408437
C  -2.326525 0.696335 -1.086378
C  2.565843 2.933531 -0.432856
C  -2.628465 2.944004 0.614807
C  1.528241 1.604199 1.349506
C  -1.220026 1.52714 -0.809951
C  3.585069 -2.303794 -2.023692
C  7.459026 -1.502872 1.468837
C  -4.367343 -1.968274 2.424473
C  -6.878804 -1.6795 -2.202005
C  2.275318 -1.516742 -2.068395
C  8.90499 -1.85822 1.142081
C  -3.1198 -1.167984 2.797868
C  -8.3581 -2.031235 -2.31276
H  4.568393 2.284341 -1.040144
H  -4.721597 2.324267 0.777117
H  2.724778 -0.052932 2.118432
H  -2.225082 -0.172944 -1.742922
H  2.514893 3.760504 -1.148065
H  -2.739587 3.805588 1.28139
H  0.68461 1.419622 2.02221
H  -0.246973 1.30422 -1.259461
H  3.490639 -3.223235 -1.415182
H  3.950433 -2.562781 -3.030739
H  7.007208 -2.213283 2.187925
H  7.359429 -0.471954 1.854547
H  -4.107099 -2.956382 1.999743
H  -5.049284 -2.101387 3.280111
H  -6.231583 -2.455621 -2.654624
H  -6.648875 -0.696812 -2.652425
H  1.914743 -1.283461 -1.050887
H  2.407083 -0.572979 -2.625095
H  1.498824 -2.118091 -2.577605
H  8.974417 -2.881663 0.737225
H  9.319726 -1.156911 0.398815
H  9.518434 -1.799528 2.060158
H  -2.44275 -1.060342 1.932246
H  -3.393503 -0.162865 3.16165
H  -2.569694 -1.692441 3.601875
H  -8.565966 -3.00342 -1.835343
H  -8.978622 -1.26044 -1.8258
H  -8.646991 -2.09242 -3.378352
