program: Gaussian 09
title: 000267816
version: EM64L-G09RevD.01
frameworkgroup: C1[X(C11H12BrN3O5)]
method: RPBEPBE
basis: SDD
operation: Freq
keyword: #p
keyword: freq=noraman
keyword: PBEPBE/SDD
title: #p freq=noraman PBEPBE/SDD
converged: YES YES NO NO
title: Mulliken charges:
elementType: Br O O O O O N N N C C C C C C C C C C C H H H H H H H H H H H H
charge: 0.031188 -0.264107 -0.491769 -0.455771 -0.501688 -0.216966 -0.200613 -0.394434 -0.009289 -0.090493 -0.107242 -0.219038 -0.094985 -0.349272 0.323381 -0.170635 0.170344 -0.347736 0.003783 -0.250573 0.280385 0.261817 0.269811 0.273579 0.231437 0.240026 0.291284 0.388044 0.392467 0.380245 0.385430 0.241390
chargesum: 0.00000
title: Mulliken charges with hydrogens summed into heavy atoms:
elementType: Br O O O O O N N N C C C C C C C C C C C
charge: 0.031188 -0.264107 -0.103725 -0.063304 -0.116258 -0.216966 -0.200613 -0.014189 -0.009289 0.189893 0.154575 0.050773 0.178594 0.122191 0.323381 0.120648 0.170344 -0.347736 0.003783 -0.009183
polarizability: 2.20044576e+02 -6.08554287e+00 1.85399474e+02 1.49903359e+01 4.58931605e+00 1.01220877e+02
1716.lowfreq: -8.1874 -5.7499 -0.0007 -0.0006 -0.0004 6.4452 21.3749 24.3465 52.1314
frequency: 21.1192 24.3347 52.0960 69.3223 89.7916 97.8927 126.4871 156.8995 172.2267 191.8675 226.4981 231.0512 259.8440 270.1532 284.4744 299.5079 317.5855 323.6058 359.6331 382.1938 429.2886 437.4464 454.4574 494.0515 505.3693 528.7770 582.2178 592.8998 601.0490 610.9119 622.3679 652.4901 676.0971 685.3401 763.5084 779.9817 792.5234 811.1289 837.3282 890.8338 898.7431 906.9652 944.3307 961.5136 964.0075 981.9204 1014.8855 1045.7916 1060.8138 1068.0633 1086.8828 1096.9264 1118.0458 1149.5333 1172.0746 1205.3742 1211.3006 1214.8408 1250.6768 1265.4114 1279.6401 1284.4704 1307.4529 1336.0211 1347.5471 1356.1368 1357.5003 1379.3101 1390.7825 1396.4415 1402.3496 1448.8598 1485.0984 1487.3043 1516.7318 1562.3645 1591.4160 1613.1027 2985.3662 2995.7720 3004.3006 3017.1491 3053.5417 3089.1170 3124.9932 3268.9380 3289.0257 3294.0227 3561.6753 3610.2742
redmass: 6.8483 7.5975 7.9229 8.6650 6.2132 8.5496 9.5069 3.5203 7.6595 9.2881 6.6540 6.8464 2.6879 5.7502 1.7825 7.2079 8.2614 3.3719 4.8194 5.0025 2.7836 1.6890 3.2583 3.8314 7.6914 3.8746 3.6852 4.1023 2.6043 1.8368 7.8677 11.6026 4.2894 5.3991 1.3719 7.4840 3.7018 1.3088 2.5492 4.6224 1.4462 8.6695 4.6472 2.6524 7.6291 9.3471 3.0772 3.8461 3.4251 3.3595 3.5401 3.6346 2.1639 1.5920 1.2117 1.4032 1.3551 1.9772 1.3089 1.6446 1.3939 1.2142 2.2475 1.6199 1.3406 1.3955 1.4598 4.7669 1.5102 1.8568 1.5863 1.2418 1.2971 2.9945 6.6870 3.5172 3.3717 12.3160 1.0613 1.0815 1.0853 1.0866 1.1051 1.0912 1.0924 1.0987 1.0786 1.0741 1.0661 1.0673
irintensity: 4.7900 0.0989 3.8399 1.6029 4.7605 0.5460 10.2628 3.6013 2.0754 1.2541 12.0927 3.7937 30.6098 7.9675 74.0152 11.8653 3.4582 42.6349 3.2885 12.5867 34.7633 59.8212 60.4410 3.3135 1.6091 31.0820 19.7051 21.9952 25.5239 74.4520 11.9695 7.2986 28.8189 6.7324 38.1462 23.9057 26.8611 76.7776 10.1116 9.9468 3.8390 65.0055 58.2955 17.5850 47.1664 238.1056 25.1412 14.8652 25.5988 44.6136 24.1177 46.9536 25.3534 30.4128 4.9285 10.3951 30.5643 37.6158 28.3963 5.9473 9.2168 38.8390 87.0695 1.1280 3.6288 0.3861 25.2238 76.4638 39.5289 15.3412 3.8461 75.3617 13.2235 29.6139 110.3205 194.8118 82.3963 433.7393 28.1935 6.6016 7.4971 64.8054 18.6435 34.5581 23.0533 6.5059 464.4175 350.3250 38.2082 24.4143
temp: 298.150 k
press: 1.00000 atm
elementType: 35 8 8 8 8 8 7 7 7 6 6 6 6 6 6 6 6 6 6 6 1 1 1 1 1 1 1 1 1 1 1 1
symmnumber: 1
zpe: 611049.3 jmol-1
zpe.correction: 0.232736 hartree
zpe.thermalcorrener: 0.251080 hartree
zpe.thermalcorrenthalpy: 0.252024 hartree
zpe.thermalcorrgfe: 0.184200 hartree
zpe.sumelectzpe: -978.669246 hartree
zpe.sumelectthermal: -978.650903 hartree
zpe.sumelectthermalent: -978.649959 hartree
zpe.sumelectthermalfe: -978.717783 hartree
dipole: -12.2594 -2.9163 0.0969
dipole: 12.6019
quadrupole: -157.9207 -114.2168 -121.3148
quadrupole: -6.3246 -12.8890 -10.6923
quadrupole: -26.7700 16.9340 9.8360 -6.3246 -12.8890 -10.6923
hfenergy: -978.9019825 hartree
pointgroup: C01 [X(C11H12Br1N3O5)]
dipole: 4.8802472 0.6953677 -0.530151 debye
polarizability: 211.7233281|18.9588858|186.511489|4.2516292|-27.1885514|108.4301102 unknown
InChI: InChI=1S/C11H12BrN3O5/c12-4-1-15(9-6(4)10(19)14-3-13-9)11-8(18)7(17)5(2-16)20-11/h1,3,5,7-8,11,13,16-18H,2H2
charge 0 multiplicity 1
32 atoms
Br -2.503349 -3.425113 1.35749
O  2.288983 -0.347741 1.459844
O  1.264742 2.675607 -0.260613
O  3.956657 1.447337 -1.353517
O  4.440569 -1.166792 -1.47859
O  -4.54647 -1.047604 -0.200524
N  -0.021264 -0.161338 0.823273
N  -1.37756 1.636223 -0.238833
N  -3.686633 1.089704 -0.708669
C  1.229132 0.590061 1.044696
C  1.748907 1.293452 -0.230866
C  3.285441 1.173001 -0.100195
C  3.436819 -0.247472 0.510005
C  3.346837 -1.402081 -0.51062
C  -1.188243 0.366374 0.286023
C  -0.303658 -1.475985 1.272399
C  -2.225904 -0.591515 0.346962
C  -1.636102 -1.750279 0.975062
C  -3.561922 -0.260097 -0.182145
C  -2.663553 1.918379 -0.713436
H  1.086209 1.327594 1.858237
H  1.414518 0.759065 -1.142761
H  3.632595 1.92074 0.639206
H  4.352722 -0.349727 1.1124
H  2.363944 -1.406924 -1.022177
H  3.482924 -2.36581 0.013601
H  0.462371 -2.073345 1.755475
H  1.781619 3.178629 -0.940662
H  4.287144 0.577254 -1.733827
H  -0.599562 2.318005 -0.299615
H  4.577568 -1.947409 -2.067067
H  -2.790881 2.930606 -1.116657
