program: Gaussian 09
title: 000267790
version: EM64L-G09RevD.01
frameworkgroup: C1[X(C12H14O5)]
method: RPBEPBE
basis: SDD
operation: Freq
keyword: #pfreq=noraman
keyword: PBEPBE/SDD
title: #p freq=noraman PBEPBE/SDD
converged: YES YES NO NO
title: Mulliken charges:
elementType: O O O O O C C C C C C C C C C C C H H H H H H H H H H H H H H
charge: -0.275254 -0.267797 -0.227215 -0.241497 -0.234505 -0.276235 -0.230024 0.543566 0.272597 -0.551379 -0.397808 0.218992 -0.335304 0.199179 -0.503569 -0.537952 -0.538509 0.259400 0.266919 0.249074 0.255773 0.243767 0.236940 0.247027 0.242577 0.248830 0.219805 0.221971 0.221837 0.220588 0.248211
chargesum: 0.00000
title: Mulliken charges with hydrogens summed into heavy atoms:
elementType: O O O O O C C C C C C C C C C C C
charge: -0.275254 -0.267797 -0.227215 -0.241497 -0.234505 -0.016835 0.036895 0.543566 0.272597 -0.302306 -0.142035 0.218992 -0.091537 0.199179 0.222974 0.152654 0.152126
polarizability: 2.26173007e+02 -3.09301583e+00 1.50844861e+02 4.65793150e+00 -3.49597002e+00 9.67364835e+01
1716.lowfreq: -6.3792 -0.0005 -0.0001 0.0003 2.8246 6.3214 20.5095 37.0270 55.5260
frequency: 20.2439 36.9682 55.5117 72.2421 87.8841 91.9351 109.1032 145.7435 152.0857 167.7727 183.6637 205.0403 236.0339 244.7913 264.0557 285.5466 319.5213 327.3213 363.7338 394.1354 429.1766 461.8200 475.1895 562.4410 591.9183 616.8957 650.7393 690.9890 726.6942 740.0937 753.0053 756.4743 808.8409 815.4578 850.1698 872.6756 912.3816 927.8331 963.6586 982.6140 1000.8387 1060.9353 1091.1361 1111.9016 1112.2147 1113.0236 1123.4800 1138.4399 1146.1966 1148.6141 1157.2057 1175.4084 1202.9342 1227.7460 1261.5184 1286.0122 1307.4001 1370.0743 1404.9154 1420.6846 1424.1160 1437.3375 1450.2437 1452.2263 1462.3292 1467.9180 1468.6021 1470.9735 1471.9874 1511.8834 1591.5471 1612.5162 1642.9818 2957.1602 2959.0967 3005.9611 3044.4229 3047.2318 3092.8915 3108.3204 3127.4010 3127.6012 3136.0528 3145.5462 3147.1188 3153.2142 3168.1206
redmass: 4.8236 4.7155 5.1141 3.2078 1.2079 3.2525 3.4186 4.7538 4.0046 3.8673 3.5997 2.5272 1.3389 3.8988 1.6594 2.8522 4.6744 4.9862 4.2144 6.4041 4.9250 3.1507 7.0656 5.5143 4.8755 4.3965 7.0322 5.5784 5.5200 3.2291 5.8171 5.5632 1.8829 3.7591 1.9353 4.2113 3.9311 1.4566 6.0030 8.4137 4.4527 1.3022 1.2392 1.2616 1.2607 1.2723 2.4303 2.4740 1.6204 1.4520 1.4217 1.5584 2.3824 1.7847 2.3223 1.4983 1.9437 2.7923 5.0284 1.5131 1.3929 1.1876 1.6837 1.0501 1.0521 1.0501 1.0510 1.0813 1.0614 2.9048 7.3125 6.4403 9.7977 1.0332 1.0331 1.0296 1.1038 1.1039 1.0898 1.1046 1.0991 1.0991 1.0905 1.0880 1.0901 1.1048 1.0953
irintensity: 1.2946 1.7015 0.6261 0.8975 0.4004 16.5610 0.5020 3.5350 0.4186 7.3653 2.7574 0.3121 0.9689 1.1912 5.3756 8.6188 7.8373 5.4758 8.1752 0.6734 3.0393 1.9072 2.6212 27.6343 9.6025 9.5214 6.0284 13.2717 28.6694 0.7974 19.5230 17.5608 59.4740 3.1715 22.4313 0.3928 2.5849 0.4099 37.5460 29.6219 46.4405 6.1052 6.1070 0.2149 0.3261 0.6736 237.7745 224.0610 60.9330 26.0771 18.8894 11.7965 64.5690 55.5969 187.7800 31.1004 25.2434 119.4209 22.4420 27.5870 83.1372 11.6819 35.7768 16.6979 11.0018 9.2347 19.6628 56.7501 37.1582 117.9176 41.2416 44.1665 163.0966 91.2172 42.4437 33.9382 42.7583 53.8576 6.4660 24.4565 3.3672 43.1150 6.9551 3.6559 9.9949 15.1835 9.0146
temp: 298.150 k
press: 1.00000 atm
elementType: 8 8 8 8 8 6 6 6 6 6 6 6 6 6 6 6 6 1 1 1 1 1 1 1 1 1 1 1 1 1 1
symmnumber: 1
zpe: 627428.7 jmol-1
zpe.correction: 0.238975 hartree
zpe.thermalcorrener: 0.256613 hartree
zpe.thermalcorrenthalpy: 0.257557 hartree
zpe.thermalcorrgfe: 0.191648 hartree
zpe.sumelectzpe: -840.435217 hartree
zpe.sumelectthermal: -840.417579 hartree
zpe.sumelectthermalent: -840.416635 hartree
zpe.sumelectthermalfe: -840.482543 hartree
dipole: 0.5439 -0.0884 3.0181
dipole: 3.0680
quadrupole: -87.8830 -83.7816 -105.2034
quadrupole: -5.5278 -12.6823 -1.6854
quadrupole: 4.4063 8.5077 -12.9140 -5.5278 -12.6823 -1.6854
hfenergy: -840.6741917 hartree
pointgroup: C01 [X(C12H14O5)]
dipole: -0.2029728 0.4556807 -1.0991208 debye
polarizability: 226.1614407|-3.6656887|139.7478388|5.1944139|21.9484008|107.8450722 unknown
InChI: InChI=1S/C12H14O5/c1-14-8-5-4-7(6-9(8)15-2)10-11(17-10)12(13)16-3/h4-6,10-11H,1-3H3
charge 0 multiplicity 1
31 atoms
O  1.979933 -1.498614 1.237079
O  4.41543 -0.180777 -1.081746
O  4.240934 0.548446 1.132869
O  -3.135142 2.105975 0.68561
O  -4.233856 -0.001375 -0.474774
C  1.302568 -0.17092 0.986044
C  2.391774 -0.6608 0.054559
C  -0.136921 -0.18247 0.598925
C  3.754278 -0.037851 0.140091
C  -0.924515 0.97325 0.849426
C  -0.730262 -1.304819 -0.015267
C  -2.28447 1.015279 0.48059
C  -2.09369 -1.276463 -0.383138
C  -2.88096 -0.126885 -0.148352
C  5.771579 0.418716 -1.14793
C  -2.565276 3.287963 1.335877
C  -4.880327 -1.153661 -1.107809
H  1.619052 0.598552 1.704286
H  2.114473 -1.076023 -0.920365
H  -0.462035 1.83867 1.335655
H  -0.136994 -2.212366 -0.168442
H  -2.540272 -2.159481 -0.849133
H  6.113627 0.227495 -2.174198
H  6.433757 -0.063411 -0.409566
H  5.720924 1.500395 -0.937885
H  -3.394826 4.007446 1.393064
H  -1.737866 3.718708 0.738235
H  -2.203579 3.053173 2.356246
H  -4.856401 -2.042688 -0.447755
H  -4.407395 -1.398453 -2.078977
H  -5.921442 -0.839412 -1.27032
