program: Gaussian 09
title: 000267779
version: EM64L-G09RevD.01
frameworkgroup: C1[X(C9H12BrN3O3)]
method: RPBEPBE
basis: SDD
operation: Freq
keyword: #p
keyword: freq=noraman
keyword: PBEPBE/SDD
title: #p freq=noraman PBEPBE/SDD
converged: NO YES NO NO
title: Mulliken charges:
elementType: Br O O O N N N C C C C C C C C C H H H H H H H H H H H H
charge: 0.025617 -0.296208 -0.258312 -0.364611 -0.246608 -0.256719 -0.334844 0.051607 -0.407813 -0.418359 -0.376217 -0.304488 -0.038149 0.058872 -0.326803 0.423606 0.257331 0.208974 0.259430 0.229831 0.208893 0.207511 0.213665 0.192962 0.226849 0.311114 0.348110 0.404758
chargesum: 0.00000
title: Mulliken charges with hydrogens summed into heavy atoms:
elementType: Br O O O N N N C C C C C C C C C
charge: 0.025617 -0.296208 -0.258312 0.040147 -0.246608 -0.256719 0.013266 0.308938 0.060591 0.020365 0.044959 0.115324 0.272964 0.058872 -0.326803 0.423606
polarizability: 2.18044693e+02 2.48167570e+00 1.58662842e+02 -4.91904880e+00 -6.01444772e-01 8.04007561e+01
1716.lowfreq: -8.3185 -3.0495 -0.0005 0.0007 0.0008 7.5827 39.5845 45.0698 74.9870
frequency: 38.3013 45.0549 74.9824 90.7552 129.4857 136.6467 164.5736 194.5199 226.1987 231.3070 235.4779 258.3377 280.6789 324.2231 339.6684 392.1500 436.0913 443.3117 456.9918 500.4492 520.1179 560.3243 615.7429 635.8464 671.4392 718.4889 743.0226 746.8532 797.8423 831.2234 835.0104 867.1628 908.1476 915.2024 932.7830 972.1029 988.4162 1022.9680 1025.6282 1051.2429 1092.4194 1100.5961 1127.9288 1161.9827 1191.2345 1216.2658 1241.9339 1249.4487 1250.4160 1280.2682 1309.3156 1315.9482 1328.8970 1339.1410 1345.6079 1362.2100 1372.5603 1448.2179 1450.6021 1454.6809 1457.5719 1463.8311 1473.6316 1556.8779 1599.9435 1643.5562 2883.3965 2956.6108 2981.2214 2983.8990 2991.4865 2999.9960 3049.5580 3058.6657 3074.2788 3088.8385 3190.5404 3636.2811
redmass: 4.5192 5.5353 4.4846 8.2691 7.6867 7.9645 4.9019 8.8343 4.9436 2.8810 4.2720 3.7343 8.6244 1.6801 2.2886 3.2663 3.0197 3.5765 3.6590 4.1085 2.5538 3.9981 8.2691 3.0442 6.4838 3.2098 5.3740 2.0993 2.3042 2.6971 1.9152 2.7721 2.4481 1.4210 1.9739 6.0539 2.0757 3.3467 4.2876 2.3420 2.2405 4.0311 2.3094 1.3303 1.4799 5.7761 1.5694 1.3887 1.2739 1.5299 1.2802 1.4784 1.5598 1.4936 1.4486 1.2674 1.6156 1.1000 3.5590 2.0261 1.1882 1.0882 1.0917 2.5599 8.4226 9.9576 1.0607 1.0684 1.0653 1.0807 1.0610 1.0645 1.0983 1.1006 1.1025 1.0978 1.0941 1.0827
irintensity: 0.2708 2.9710 1.7526 1.2775 1.4301 9.4403 7.9297 10.4269 11.0234 13.6608 3.9629 7.9096 2.4067 36.1653 18.5951 36.9237 26.9857 2.0439 11.3108 6.8917 4.1678 5.0590 21.9959 18.7051 8.9002 6.7263 4.8343 129.3507 2.3189 22.4744 7.7220 9.1874 13.4799 8.4077 13.9081 236.9510 30.2321 193.2266 9.3102 6.1832 14.9540 33.1782 5.0392 16.2181 63.5290 18.5487 76.5650 58.0990 13.3014 79.5346 18.3996 27.4453 26.9418 8.1047 7.7781 3.0590 7.0427 3.3611 57.1016 175.8937 50.1760 8.4915 10.1619 23.3309 224.4622 661.0635 52.9009 61.2515 25.4623 6.2339 32.3032 25.3795 36.7222 50.6285 19.5896 31.1355 13.7609 165.2256
temp: 298.150 k
press: 1.00000 atm
elementType: 35 8 8 8 7 7 7 6 6 6 6 6 6 6 6 6 1 1 1 1 1 1 1 1 1 1 1 1
symmnumber: 1
zpe: 556793.7 jmol-1
zpe.correction: 0.212072 hartree
zpe.thermalcorrener: 0.227254 hartree
zpe.thermalcorrenthalpy: 0.228198 hartree
zpe.thermalcorrgfe: 0.168323 hartree
zpe.sumelectzpe: -752.281625 hartree
zpe.sumelectthermal: -752.266443 hartree
zpe.sumelectthermalent: -752.265499 hartree
zpe.sumelectthermalfe: -752.325374 hartree
dipole: 2.8982 -4.7032 0.8682
dipole: 5.5923
quadrupole: -82.9941 -119.6265 -103.6291
quadrupole: 0.1269 0.0016 0.9293
quadrupole: 19.0891 -17.5433 -1.5458 0.1269 0.0016 0.9293
hfenergy: -752.4936965 hartree
pointgroup: C01 [X(C9H12Br1N3O3)]
dipole: 1.5921771 -1.4876271 0.3045285 debye
polarizability: 212.5467455|17.4483982|164.176856|-4.6002181|-0.117427|80.3846896 unknown
InChI: InChI=1S/C9H12BrN3O3/c10-6-5-13(7-3-1-2-4-16-7)9(14)11-8(6)12-15/h5,7,12,15H,1-4H2
charge 0 multiplicity 1
28 atoms
Br -2.486807 -3.225983 0.101614
O  2.171584 -0.905039 -0.832369
O  -0.194485 2.391428 -0.217407
O  -4.611028 0.971699 0.068234
N  0.127727 0.064859 -0.17591
N  -2.087331 1.000952 -0.075508
N  -3.943621 -0.292401 0.090844
C  1.590062 0.307005 -0.250793
C  2.20555 0.61436 1.130151
C  3.739376 0.771804 0.989552
C  4.35027 -0.473257 0.302949
C  3.63186 -0.75157 -1.029313
C  -0.377374 -1.216188 -0.096533
C  -0.730854 1.249897 -0.159739
C  -1.738393 -1.425855 0.002599
C  -2.586087 -0.265376 0.00716
H  1.734496 1.175921 -0.925983
H  1.96689 -0.219813 1.818228
H  1.745738 1.536524 1.526739
H  4.195089 0.93201 1.983134
H  3.961356 1.675541 0.386071
H  5.430158 -0.32656 0.108838
H  4.246384 -1.355616 0.963178
H  3.810414 0.076696 -1.748994
H  3.950456 -1.701284 -1.488158
H  0.354262 -2.025083 -0.142966
H  -4.561413 -1.098307 0.144523
H  -3.776783 1.582636 -0.005942
