program: Gaussian 09
title: 000267787
version: EM64L-G09RevD.01
frameworkgroup: C1[X(C17H18O3S2)]
method: RPBEPBE
basis: SDD
operation: Freq
keyword: #p
keyword: freq=noraman
keyword: PBEPBE/SDD
title: #p freq=noraman PBEPBE/SDD
converged: YES YES NO NO
title: Mulliken charges:
elementType: S S O O O C C C C C C C C C C C C C C C C C H H H H H H H H H H H H H H H H H H
charge: 0.179452 0.178677 -0.263155 -0.263173 -0.246949 0.537569 0.538513 -0.427819 -0.430782 -0.564980 -0.560488 0.366438 0.365889 -0.187973 -0.189221 -0.324081 -0.323892 -0.812578 -0.813952 0.246913 -0.840421 -0.841041 0.269059 0.268888 0.259494 0.259452 0.303447 0.303509 0.232238 0.253692 0.230949 0.231730 0.232475 0.253323 0.268980 0.263001 0.256602 0.264675 0.256445 0.269093
chargesum: 0.00000
title: Mulliken charges with hydrogens summed into heavy atoms:
elementType: S S O O O C C C C C C C C C C C C C C C C C
charge: 0.179452 0.178677 -0.263155 -0.263173 -0.246949 0.537569 0.538513 -0.427819 -0.430782 -0.295920 -0.291600 0.366438 0.365889 0.071521 0.070231 -0.020633 -0.020383 -0.095699 -0.096424 0.246913 -0.051837 -0.050828
polarizability: 4.14999796e+02 -1.68059259e-01 2.10458194e+02 1.19983693e+01 2.83622283e-02 1.28398110e+02
1716.lowfreq: -4.3602 -0.0023 0.0011 0.0013 2.4809 6.9074 13.1191 17.2187 37.3896
frequency: 11.9322 16.9714 37.3375 39.7341 44.3203 55.6950 64.6687 92.2528 111.2888 115.6287 117.9436 130.6339 137.4318 154.7783 155.1238 185.7884 194.7582 211.3483 220.3722 249.3248 255.8534 277.3320 306.9046 331.8672 362.6797 374.0960 405.5239 443.6716 452.6383 454.7265 486.6797 537.7452 545.1592 572.7065 574.7330 587.3460 642.4468 644.1768 664.4779 665.5409 683.2619 706.2005 720.2993 721.1237 769.0533 842.8054 845.1059 853.0715 893.6359 894.6929 916.7762 963.5635 964.1823 971.9316 972.9784 975.8835 987.3716 987.8450 1000.0074 1023.7570 1030.5905 1035.1692 1047.7811 1047.8269 1123.6360 1134.1317 1136.3650 1150.3738 1173.2278 1219.0518 1226.2120 1263.8369 1266.2758 1336.7603 1336.8132 1366.1957 1366.3282 1395.0716 1396.3814 1405.5434 1406.2200 1444.2024 1444.2367 1453.6619 1454.7894 1459.6413 1459.8960 1465.5948 1466.7819 1482.4672 1483.3937 1564.6004 1567.2983 1609.2692 1610.0085 1633.9809 2975.0235 2976.0016 3010.9416 3011.1546 3056.7825 3057.3359 3092.2126 3093.5566 3131.7561 3131.8887 3136.3957 3136.9679 3154.6262 3154.7294 3156.8247 3157.0664 3209.8057 3210.2153
redmass: 3.4564 6.6840 8.4468 5.1670 5.2752 3.4354 3.8021 4.0854 2.4512 1.1221 1.2265 1.3425 1.1251 3.1341 5.4188 3.5788 3.7697 3.7484 4.6191 6.7264 3.9194 3.8888 10.2182 8.3210 6.0936 5.7359 6.3178 3.7614 2.8769 3.0280 4.0433 5.6731 5.6721 3.6840 3.9656 6.4309 7.0552 7.2534 12.3859 7.1448 9.1463 7.1476 3.4331 3.4292 8.5227 1.3238 1.3194 7.9389 1.4156 1.4298 3.9510 1.1900 1.1792 1.3139 1.3117 2.0025 1.2886 1.2855 1.5857 2.1579 5.4568 5.6333 1.5493 1.5488 1.7037 1.5199 3.8309 2.3578 1.9429 2.5848 3.0122 1.3948 1.4898 1.1352 1.1350 8.8456 8.6597 1.2226 1.2225 3.0491 3.1800 1.0664 1.0686 1.7700 1.6748 1.1389 1.1533 1.1858 1.2401 1.1332 1.1454 6.2602 6.1925 7.1480 7.2368 11.6952 1.0391 1.0392 1.0279 1.0279 1.0940 1.0937 1.1001 1.1002 1.1044 1.1044 1.1052 1.1052 1.0914 1.0912 1.0921 1.0922 1.0946 1.0945
irintensity: 1.2268 0.5996 0.6164 0.3216 0.0314 2.3639 1.0101 0.6840 0.4229 0.0313 0.1812 0.7649 0.0055 0.9883 0.2863 1.8297 0.1960 2.5932 0.4201 2.2798 0.0393 0.0325 17.2012 13.7583 0.1091 5.0646 0.0268 2.0036 0.1802 14.6343 1.1701 4.3938 0.6759 0.0420 8.2255 1.9648 0.3185 1.0151 16.8812 2.3961 1.2361 0.7984 0.0256 0.1151 3.3463 0.0863 74.6471 2.3583 1.0702 54.8710 65.1860 13.8310 6.5139 1.1812 9.5440 3.6871 72.5839 10.9667 6.6756 0.5186 129.7456 7.2576 6.1967 17.9870 70.2558 9.4685 1433.9024 1396.2670 2.1826 64.5776 0.1766 16.3938 0.7563 1.3489 0.3726 7.0506 22.9849 19.2773 19.1404 39.1753 19.9657 13.4646 12.7096 72.2858 17.3126 51.6259 7.9167 25.6022 16.6067 108.9333 34.9869 64.3732 3.6721 28.2955 39.5510 171.0609 24.2594 24.9108 41.6724 32.0783 19.4067 20.3299 9.0557 9.4168 15.1433 15.6230 12.7911 12.6074 3.8854 7.6631 0.6492 0.5315 6.8076 1.6468
temp: 298.150 k
press: 1.00000 atm
elementType: 16 16 8 8 8 6 6 6 6 6 6 6 6 6 6 6 6 6 6 6 6 6 1 1 1 1 1 1 1 1 1 1 1 1 1 1 1 1 1 1
symmnumber: 1
zpe: 801163.5 jmol-1
zpe.correction: 0.305147 hartree
zpe.thermalcorrener: 0.329028 hartree
zpe.thermalcorrenthalpy: 0.329972 hartree
zpe.thermalcorrgfe: 0.247728 hartree
zpe.sumelectzpe: -1678.789685 hartree
zpe.sumelectthermal: -1678.765804 hartree
zpe.sumelectthermalent: -1678.764860 hartree
zpe.sumelectthermalfe: -1678.847104 hartree
dipole: -0.0338 2.2474 0.0271
dipole: 2.2478
quadrupole: -124.9443 -137.4536 -146.4101
quadrupole: -0.3400 22.5820 0.0228
quadrupole: 11.3250 -1.1843 -10.1408 -0.3400 22.5820 0.0228
hfenergy: -1679.0948322 hartree
pointgroup: C01 [X(C17H18O3S2)]
dipole: -0.0208209 0.8822115 0.0578948 debye
polarizability: 414.8381374|0.8208464|210.2197748|13.7347523|4.5218916|128.7981882 unknown
InChI: InChI=1S/C17H18O3S2/c1-11-9-13(5-7-15(11)21-3)19-17(18)20-14-6-8-16(22-4)12(2)10-14/h5-10H,1-4H3
charge 0 multiplicity 1
40 atoms
S  7.005893 -1.391849 -0.434482
S  -6.973704 -1.565854 0.328644
O  1.09353 -0.027038 -0.038446
O  -1.090917 -0.051679 0.054123
O  0.020276 -2.13508 -0.105127
C  4.762507 0.385445 -0.186358
C  -4.765816 0.272324 0.270711
C  5.214967 -0.966055 -0.263126
C  -5.193143 -1.087332 0.19477
C  3.36791 0.611521 -0.111644
C  -3.376111 0.531877 0.213078
C  2.456631 -0.463976 -0.120964
C  -2.44547 -0.520148 0.094809
C  4.284671 -2.030079 -0.277533
C  -4.243482 -2.128318 0.081834
C  2.891977 -1.80327 -0.209776
C  -2.855835 -1.868876 0.033338
C  5.715256 1.564659 -0.184414
C  -5.739328 1.426201 0.410802
C  0.008968 -0.890182 -0.038019
C  7.612436 -1.052619 1.326642
C  -7.616576 -0.996141 -1.358333
H  2.973114 1.63073 -0.053279
H  -3.000439 1.558469 0.269085
H  4.657411 -3.056975 -0.343335
H  -4.596901 -3.162838 0.030671
H  2.185214 -2.632897 -0.222419
H  -2.134148 -2.681246 -0.051198
H  6.065913 1.794925 0.840643
H  6.608696 1.347065 -0.795174
H  5.225102 2.473023 -0.573926
H  -5.275369 2.276793 0.938542
H  -6.068062 1.795516 -0.580318
H  -6.642511 1.110994 0.961876
H  7.04116 -1.664489 2.040483
H  7.516782 0.016285 1.569819
H  8.674284 -1.345005 1.34328
H  -7.543529 0.097976 -1.449577
H  -8.673323 -1.304035 -1.399563
H  -7.047532 -1.490422 -2.159638
