program: Gaussian 09
title: 000267824
version: EM64L-G09RevD.01
frameworkgroup: C1[X(C22H23NO3)]
method: RPBEPBE
basis: SDD
operation: Freq
keyword: #p
keyword: freq=noraman
keyword: PBEPBE/SDD
title: #p freq=noraman PBEPBE/SDD
converged: YES YES NO NO
title: Mulliken charges:
elementType: O O O N C C C C C C C C C C C C C C C C C C C C C C H H H H H H H H H H H H H H H H H H H H H H H
charge: -0.295565 -0.285258 -0.454591 -0.004141 0.190023 0.418642 0.158982 -0.442009 0.005972 -0.535082 -0.568090 -0.441211 -0.346321 -0.765943 0.486865 0.390903 -0.407526 -0.397293 -0.390173 -0.401446 -0.226958 -0.228524 -0.226316 -0.216788 -0.232569 -0.240413 0.212066 0.181105 0.259434 0.260052 0.252858 0.199639 0.234900 0.201710 0.208551 0.250872 0.251120 0.226695 0.230383 0.287610 0.225535 0.275453 0.336782 0.225393 0.226476 0.225505 0.227014 0.227685 0.227993
chargesum: 0.00000
title: Mulliken charges with hydrogens summed into heavy atoms:
elementType: O O O N C C C C C C C C C C C C C C C C C C C C C C
charge: -0.295565 -0.285258 -0.117809 -0.004141 0.190023 0.418642 0.158982 -0.048837 0.005972 -0.015596 -0.315232 -0.006672 0.063940 -0.037255 0.486865 0.390903 -0.177143 -0.109684 -0.164638 -0.125994 -0.001565 -0.002048 -0.000811 0.010226 -0.004885 -0.012420
polarizability: 3.07208133e+02 3.85057801e+00 2.61076208e+02 3.98826311e+01 4.97964380e+00 1.97692640e+02
1716.lowfreq: -7.1476 -6.3630 -2.5532 -0.0003 -0.0003 0.0005 5.3275 13.1137 19.9726
frequency: -3.7418 13.0290 19.9072 31.0729 40.0704 43.6675 57.0678 63.4727 92.8780 94.2741 104.3431 111.1556 113.5098 140.4125 159.4371 206.4739 217.1794 242.3727 248.4445 276.7444 291.2059 302.7876 327.9328 348.3371 348.8877 392.3044 400.9574 406.6677 424.4911 463.5104 469.7438 505.5727 515.1802 542.9973 560.7299 586.5636 615.9692 617.2695 618.9093 624.9696 692.1274 702.1085 708.3254 739.0482 752.9776 761.0474 785.7943 811.9398 828.9078 852.9461 856.4310 862.7097 878.4560 903.0938 911.2426 921.4447 928.6555 938.1219 942.9329 969.6136 979.2414 984.5151 985.8816 989.4464 990.2631 996.8615 1002.9507 1013.8278 1022.1482 1026.3667 1027.6255 1031.8779 1045.0929 1064.9294 1084.1848 1089.3329 1155.0778 1171.8456 1172.4434 1184.4404 1185.1675 1188.8395 1192.1843 1197.3725 1202.1579 1216.6793 1230.6887 1256.4837 1285.8684 1300.0533 1303.3678 1318.8291 1330.9478 1334.8122 1343.8077 1372.8392 1380.1256 1386.4825 1387.7750 1391.8083 1401.5700 1439.5011 1442.0902 1444.2661 1461.0212 1466.9227 1469.8707 1473.1309 1476.0393 1485.3301 1486.8446 1487.2186 1550.7503 1567.5227 1595.1219 1595.2898 1616.7496 1618.0627 2900.1276 2908.4609 2944.4918 2968.5222 2980.9062 2983.5053 3031.5507 3057.4870 3070.2284 3110.0197 3112.8017 3114.4691 3118.3638 3119.8433 3124.5081 3127.1830 3135.6226 3140.6052 3146.9347 3158.6116 3162.4551 3173.7823 3556.7830
redmass: 3.9661 5.4146 4.4594 4.6908 4.0988 4.6606 3.8305 3.3951 5.2103 4.2248 1.0521 4.6583 3.9507 5.3444 4.8141 3.4183 4.4862 4.9935 3.7906 1.7467 3.6103 3.2532 2.0140 3.7772 1.6917 4.5490 2.8402 2.8589 5.2738 2.9022 3.9550 4.6805 3.5657 5.4951 5.5461 5.1842 6.3524 6.3069 5.1918 5.5808 5.3262 2.3099 1.8177 1.3897 2.3147 4.8661 3.6182 4.3004 4.0049 3.8253 1.2511 1.3373 2.9285 1.9375 1.3729 6.1613 2.5607 1.5138 2.2715 1.6353 1.3979 1.6767 1.4292 6.1683 5.6298 1.3862 1.3152 1.8254 3.2974 1.8748 2.1933 2.9597 1.5861 2.9253 1.6267 1.5301 1.3317 1.0538 1.0560 1.1157 1.2560 1.1121 1.1227 1.6969 1.7281 2.1462 2.5486 3.9579 1.5208 1.6468 1.4229 2.7378 1.2735 1.3470 1.4814 1.2261 3.1608 5.8844 1.3890 2.9498 1.8294 2.1367 2.1821 1.6515 1.3809 1.1383 1.1936 1.0903 1.1215 2.0885 1.4017 1.6791 6.6797 7.3668 6.1906 6.0991 6.0380 6.0552 1.0579 1.0595 1.1040 1.0977 1.0500 1.0497 1.0621 1.1063 1.0911 1.0877 1.1029 1.0919 1.0862 1.1008 1.0875 1.0867 1.0924 1.0930 1.0966 1.0980 1.1016 1.0970 1.0666
irintensity: 0.0647 0.2383 0.1174 0.2032 0.1678 0.3549 1.0534 1.5164 0.1716 3.5788 0.2466 7.1847 11.6525 1.5302 1.4189 1.5052 0.3659 0.3803 1.7022 24.9709 10.7637 3.5254 35.4110 1.8043 70.4412 24.3276 0.5077 0.3645 0.4234 11.8118 4.4486 5.3952 2.3041 0.5427 6.5879 0.1755 0.1277 0.2741 4.4711 16.1834 6.4282 25.7766 48.9739 82.4010 86.7606 9.8329 4.2610 4.3264 47.4022 33.0619 0.2697 3.4763 22.1338 26.2159 13.7604 81.6599 9.5638 0.9245 0.7026 1.0430 0.3505 13.8994 2.4277 0.0780 0.0268 10.0864 0.2656 33.1448 143.1910 15.1825 6.0916 75.9333 9.5562 70.1796 10.7101 9.2302 55.3923 0.2824 0.1307 3.7217 32.9982 4.9974 2.0167 92.9285 32.0555 0.6981 14.3696 3.2810 9.3411 13.0747 48.9103 4.4059 0.8361 60.5801 44.6599 11.7010 29.0934 0.7824 29.2106 31.6610 5.3412 9.8452 9.3233 14.4902 15.9122 3.3704 21.0804 22.2188 5.5456 13.2192 12.6295 5.0277 2.8802 15.1102 1.5798 0.6322 0.1044 7.6991 19.9353 110.5850 47.2063 40.4575 8.4564 58.6977 24.7137 9.5517 13.7821 10.8561 1.2828 28.1872 6.1680 7.4831 2.6095 1.1843 11.6972 31.1358 27.2043 32.3866 34.2989 7.0620 7.1361
temp: 298.150 k
press: 1.00000 atm
elementType: 8 8 8 7 6 6 6 6 6 6 6 6 6 6 6 6 6 6 6 6 6 6 6 6 6 6 1 1 1 1 1 1 1 1 1 1 1 1 1 1 1 1 1 1 1 1 1 1 1
symmnumber: 1
zpe: 1037387.4 jmol-1
zpe.correction: 0.395120 hartree
zpe.thermalcorrener: 0.419064 hartree
zpe.thermalcorrenthalpy: 0.420009 hartree
zpe.thermalcorrgfe: 0.337878 hartree
zpe.sumelectzpe: -1130.641376 hartree
zpe.sumelectthermal: -1130.617432 hartree
zpe.sumelectthermalent: -1130.616487 hartree
zpe.sumelectthermalfe: -1130.698618 hartree
dipole: -1.1314 -0.3162 -3.1537
dipole: 3.3653
quadrupole: -135.4601 -156.3460 -143.5657
quadrupole: 2.0274 11.2888 -6.4760
quadrupole: 9.6638 -11.2221 1.5582 2.0274 11.2888 -6.4760
hfenergy: -1131.036496 hartree
pointgroup: C01 [X(C22H23N1O3)]
dipole: -0.35613 -0.3989373 -1.2112282 debye
polarizability: 301.0550717|15.1824987|262.4941188|43.9987838|-4.0846039|202.4277906 unknown
InChI: InChI=1S/C22H23NO3/c1-17-22(26-15-19-10-6-3-7-11-19)21(13-24)20(12-23-17)16-25-14-18-8-4-2-5-9-18/h2-12,24H,13-16H2,1H3
charge 0 multiplicity 1
49 atoms
O  2.390898 0.871255 0.573823
O  -2.788795 0.406254 -0.807263
O  1.189711 -0.938248 -1.892065
N  0.308086 3.826491 -0.267173
C  0.264288 0.99464 -0.622192
C  -0.814655 1.800518 -1.084498
C  1.349672 1.64752 0.021793
C  -2.025741 1.216397 -1.775405
C  1.348789 3.063523 0.1891
C  0.290127 -0.514422 -0.779439
C  -0.732369 3.19839 -0.883121
C  3.584733 0.661788 -0.329152
C  -3.999571 -0.165672 -1.409737
C  2.483257 3.773535 0.89043
C  4.374615 -0.504845 0.207762
C  -4.777704 -0.927076 -0.350515
C  5.47123 -0.300006 1.081288
C  4.013774 -1.828253 -0.156759
C  -5.803999 -1.820834 -0.747932
C  -4.51654 -0.740436 1.028004
C  6.198676 -1.400027 1.589098
C  4.73977 -2.928013 0.350606
C  -6.566014 -2.51246 0.219246
C  -5.276164 -1.437802 1.995516
C  5.833124 -2.716712 1.224367
C  -6.304003 -2.322448 1.59651
H  -2.665599 2.034821 -2.170555
H  -1.734278 0.571697 -2.637161
H  0.746767 -0.973439 0.110057
H  -0.727793 -0.916912 -0.922969
H  -1.546222 3.851464 -1.222472
H  4.180423 1.595624 -0.328975
H  3.198504 0.451144 -1.342598
H  -3.725623 -0.842343 -2.250985
H  -4.623019 0.656084 -1.832065
H  2.11544 4.719272 1.31834
H  2.914998 3.137699 1.681521
H  3.294003 4.023347 0.17829
H  5.751646 0.72159 1.366675
H  3.168663 -1.979848 -0.839122
H  -6.008876 -1.979943 -1.814797
H  -3.714913 -0.058924 1.326133
H  0.804116 -0.623696 -2.748849
H  7.045806 -1.233098 2.263873
H  4.457916 -3.947479 0.063857
H  -7.356905 -3.200707 -0.099761
H  -5.063981 -1.290007 3.060518
H  6.397409 -3.570968 1.615791
H  -6.891876 -2.861132 2.348163
