program: Gaussian 09
title: 000267771
version: EM64L-G09RevD.01
frameworkgroup: C1[X(C14H22ClN5)]
method: RPBEPBE
basis: SDD
operation: Freq
keyword: #p
keyword: freq=noraman
keyword: PBEPBE/SDD
title: #p freq=noraman PBEPBE/SDD
converged: YES YES NO NO
title: Mulliken charges:
elementType: Cl N N N N N C C C C C C C C C C C C C C H H H H H H H H H H H H H H H H H H H H H H
charge: 0.016531 -0.186256 -0.114781 -0.033184 -0.015324 0.060384 -0.032195 -0.362313 -0.394496 -0.371961 -0.716620 -0.316762 -0.312599 0.160791 -0.223186 0.115186 -0.682493 -0.675094 -0.302586 -0.373473 0.191737 0.186560 0.273247 0.208725 0.190446 0.195864 0.199008 0.223197 0.261861 0.220439 0.188496 0.206022 0.185122 0.204589 0.273853 0.237638 0.206574 0.211484 0.228300 0.203257 0.208658 0.255354
chargesum: 0.00000
title: Mulliken charges with hydrogens summed into heavy atoms:
elementType: Cl N N N N N C C C C C C C C C C C C C C
charge: 0.016531 -0.186256 -0.114781 -0.033184 -0.015324 0.060384 0.159543 0.097495 0.004675 0.022911 -0.011124 0.077755 0.077112 0.160791 0.050667 0.115186 -0.026797 -0.034879 -0.302586 -0.118118
polarizability: 2.13014278e+02 -3.20138232e+01 1.92387219e+02 -1.98684858e+01 -1.65115771e+01 1.70172037e+02
1716.lowfreq: -9.0581 -7.6463 -0.0016 -0.0010 0.0007 6.2480 15.6830 23.6485 30.7864
frequency: 13.3225 23.3287 30.7602 42.7357 54.2957 82.7167 86.0942 107.1359 135.1850 155.7105 164.5628 188.1660 198.3635 211.9783 221.4311 230.1172 245.9068 275.5268 288.9994 293.3068 329.3074 333.9613 377.8878 416.7876 440.4110 453.8768 463.5626 487.2241 539.1068 553.7884 558.0501 627.2673 652.3809 660.1743 675.5499 700.9806 783.3469 791.4134 796.2877 799.0307 802.2660 847.0480 852.9708 894.2853 912.6462 914.9418 921.9500 925.8828 984.5809 1005.2238 1041.2045 1055.0707 1073.7174 1083.5210 1087.7028 1089.3154 1103.4829 1114.7171 1123.3731 1146.3867 1155.1696 1184.7073 1192.9759 1204.5232 1224.2314 1251.1225 1274.2159 1280.9829 1283.6689 1287.1203 1289.7539 1296.2505 1307.7333 1318.1807 1352.3234 1356.6320 1363.2876 1366.7414 1376.7707 1378.2396 1386.5045 1387.9532 1392.7505 1400.4986 1444.1495 1458.2139 1459.9070 1463.4194 1468.2624 1472.8008 1473.2736 1478.2349 1481.7185 1486.4443 1488.4908 1492.2985 1500.2853 1563.4775 2848.1689 2851.3516 2864.9408 2967.1171 2980.9146 2984.1482 2984.8875 2986.4793 2993.4459 3014.1769 3029.9852 3036.5189 3037.3358 3066.9431 3073.1167 3077.5097 3089.7208 3090.3942 3090.8097 3104.9347 3182.6510 3227.6898
redmass: 4.5386 4.3412 5.2671 4.3668 3.5178 1.9969 3.1712 2.6033 4.2939 2.7327 3.5778 1.3688 6.7524 1.2178 3.0541 1.1343 3.5179 3.7748 2.2137 1.9124 2.3019 3.4271 13.0557 3.0969 2.8123 3.2518 2.6554 4.1693 3.4469 5.4686 4.8685 6.4773 4.5145 7.7681 3.5380 2.4495 1.3790 5.2485 1.1606 2.1848 2.3869 1.5249 1.8479 8.2665 1.8256 1.4326 2.2000 1.6644 1.6251 2.3390 2.4306 2.3257 1.8583 2.3850 2.0832 2.6057 3.4768 2.3631 2.0079 2.9672 2.2656 2.0695 2.5842 2.3229 1.8338 1.4060 1.8267 1.9499 1.3713 1.6789 1.5959 1.3170 2.9161 1.3996 2.2794 2.1300 1.3612 1.3222 1.5457 1.4241 1.2372 1.2267 1.2194 1.9740 3.7846 1.0797 1.0647 1.0550 1.0583 1.0710 1.0804 1.0629 1.0585 1.1000 1.0694 1.0901 5.0113 9.8242 1.0723 1.0721 1.0710 1.0612 1.0364 1.0357 1.0657 1.0810 1.0382 1.0925 1.0864 1.0892 1.0888 1.0994 1.0980 1.0982 1.1003 1.0999 1.1002 1.1008 1.0927 1.0984
irintensity: 0.0984 0.2052 0.0938 0.2522 0.3444 0.1541 0.1419 0.4869 0.4888 0.3369 1.0910 1.0145 1.3858 0.3403 0.1149 0.5466 0.8820 0.7638 1.6817 1.1412 0.5235 0.8008 9.1692 6.0541 2.4523 0.4717 5.2911 2.8124 2.7108 5.3071 10.9180 7.7202 16.2597 8.8310 4.3905 11.0012 10.8135 4.0636 7.2243 18.4314 21.5644 12.2137 2.3299 84.7544 1.2056 14.4769 0.3965 6.0893 4.1612 3.0456 10.7971 9.7547 16.0395 4.5492 14.7996 46.4799 28.6405 2.8353 5.0819 64.6436 20.0327 38.6444 55.0500 11.8259 22.7724 22.5606 13.2958 24.7441 0.0339 20.9872 22.5951 15.9578 45.4393 7.8983 32.2523 47.5642 6.5974 1.7403 14.8916 10.2158 22.1149 16.0241 25.5421 42.3331 99.8893 2.4264 2.3866 7.0149 9.6639 10.9537 9.6681 11.3291 10.3591 30.2101 10.9245 18.4995 86.8069 69.0467 37.1363 30.4895 275.2214 37.3693 20.7830 24.7947 21.2678 29.9976 33.5142 9.5559 11.3960 27.8276 37.7887 23.5761 53.3024 64.3884 36.7924 30.0731 55.1128 14.8802 8.6228 0.2390
temp: 298.150 k
press: 1.00000 atm
elementType: 17 7 7 7 7 7 6 6 6 6 6 6 6 6 6 6 6 6 6 6 1 1 1 1 1 1 1 1 1 1 1 1 1 1 1 1 1 1 1 1 1 1
symmnumber: 1
zpe: 915722.7 jmol-1
zpe.correction: 0.348780 hartree
zpe.thermalcorrener: 0.369769 hartree
zpe.thermalcorrenthalpy: 0.370714 hartree
zpe.thermalcorrgfe: 0.296213 hartree
zpe.sumelectzpe: -1278.950692 hartree
zpe.sumelectthermal: -1278.929703 hartree
zpe.sumelectthermalent: -1278.928758 hartree
zpe.sumelectthermalfe: -1279.003259 hartree
dipole: -5.5592 3.4757 -0.3862
dipole: 6.5676
quadrupole: -142.2692 -118.7942 -129.6885
quadrupole: 5.2045 4.6977 -0.7265
quadrupole: -12.0186 11.4564 0.5621 5.2045 4.6977 -0.7265
hfenergy: -1279.2994719 hartree
pointgroup: C01 [X(C14H22Cl1N5)]
dipole: -2.022695 1.6063821 -0.0692383 debye
polarizability: 207.6128639|-30.7393991|202.1452818|-23.2614746|-12.2151844|165.8153884 unknown
InChI: InChI=1S/C14H22ClN5/c1-4-19(5-2)8-6-7-11(3)20-10-18-12-13(15)16-9-17-14(12)20/h9-11H,4-8H2,1-3H3
charge 0 multiplicity 1
42 atoms
Cl 4.508221 -2.103968 -0.591433
N  1.079244 1.563616 0.02953
N  -3.083531 -0.678167 -0.575063
N  2.871643 0.771349 -1.194007
N  0.902188 -0.275611 1.694189
N  2.589339 -2.010266 1.330466
C  -0.043749 2.46473 0.427975
C  -1.410678 1.761658 0.235572
C  -1.703725 1.340914 -1.218612
C  -3.049008 0.587999 -1.352632
C  0.163695 2.972385 1.870815
C  -2.351468 -1.784119 -1.253998
C  -4.461089 -1.068225 -0.168309
C  1.448178 0.35374 0.618324
C  1.963752 1.753713 -1.042297
C  2.567851 -0.124543 -0.158896
C  -1.845708 -2.860645 -0.274698
C  -5.004536 -0.23104 1.00592
C  3.101085 -1.358137 0.275259
C  1.521362 -1.450449 1.993165
H  0.020789 3.322152 -0.272868
H  -2.192474 2.467997 0.581098
H  -1.471699 0.872386 0.888166
H  -0.882033 0.700322 -1.595703
H  -1.73581 2.232476 -1.879901
H  -3.855572 1.244762 -0.976306
H  -3.264356 0.410171 -2.436969
H  1.13793 3.480932 1.979754
H  0.120404 2.132984 2.584861
H  -0.633293 3.692274 2.127996
H  -2.981911 -2.25736 -2.049705
H  -1.478449 -1.345728 -1.771741
H  -5.171792 -1.015363 -1.032928
H  -4.431234 -2.127479 0.144942
H  1.898938 2.633289 -1.680768
H  -1.194762 -2.400256 0.489031
H  -2.676377 -3.368234 0.248262
H  -1.268622 -3.634396 -0.814455
H  -4.329938 -0.317962 1.875554
H  -5.091832 0.84028 0.747649
H  -6.010436 -0.585343 1.299541
H  1.136962 -2.012333 2.847827
