program: Gaussian 09
title: 000267801
version: EM64L-G09RevD.01
frameworkgroup: C1[X(C16H20N6O6S)]
method: RPBEPBE
basis: SDD
operation: Freq
keyword: #p
keyword: freq=noraman
keyword: PBEPBE/SDD
title: #p freq=noraman PBEPBE/SDD
converged: YES YES NO NO
title: Mulliken charges:
elementType: S O O O O O O N N N N N N C C C C C C C C C C C C C C C C H H H H H H H H H H H H H H H H H H H H
charge: 0.948900 -0.537871 -0.538602 -0.322632 -0.274005 -0.288538 -0.204875 -0.413726 -0.040161 0.031784 -0.447243 -0.718959 -0.616159 -0.624759 -0.365684 0.512045 0.440894 -0.397131 -0.380168 -0.041754 -0.237355 -0.244935 0.070948 -0.520300 0.241873 0.091600 0.267995 -0.214657 -0.672784 0.239334 0.238249 0.235771 0.237790 0.366524 0.250925 0.250335 0.285212 0.285812 0.245979 0.340553 0.335982 0.335768 0.340922 0.372118 0.231023 0.230500 0.229116 0.229096 0.215250
chargesum: 0.00000
title: Mulliken charges with hydrogens summed into heavy atoms:
elementType: S O O O O O O N N N N N N C C C C C C C C C C C C C C C C
charge: 0.948900 -0.537871 -0.538602 -0.322632 -0.274005 -0.288538 -0.204875 -0.047202 -0.040161 0.031784 -0.106690 -0.047210 0.096881 -0.147176 0.107878 0.512045 0.440894 -0.146206 -0.129833 -0.041754 0.047857 0.040877 0.070948 -0.274321 0.241873 0.091600 0.267995 0.246866 0.000678
polarizability: 3.75364322e+02 -1.47743691e+01 3.43198424e+02 3.29186193e+00 3.26507579e+00 1.78524899e+02
1716.lowfreq: -3.3264 -0.0017 -0.0015 -0.0015 2.1971 3.3050 11.5904 15.5477 19.5055
frequency: 11.1387 15.5149 19.2101 20.8582 35.1262 41.5597 44.5202 49.3947 51.3170 79.2465 86.9717 97.0319 108.4574 130.4039 134.5403 134.8023 150.1741 166.3413 166.8280 203.6796 214.3902 238.8922 249.3237 255.3661 266.1391 269.5472 299.0452 303.9714 312.5920 316.0363 343.7800 363.3373 365.8426 385.2906 407.1525 407.8255 415.0534 430.9568 452.5745 485.6839 530.0832 541.5566 570.3221 588.9841 615.0001 621.7582 626.1574 653.7797 656.8140 666.4123 681.2713 684.8761 711.1625 728.3783 729.6589 745.0579 746.0070 769.4478 775.1793 789.0590 797.6609 799.9288 802.7938 809.9223 819.0760 853.7645 859.0453 866.4152 908.8546 925.6298 969.7774 982.9360 985.4103 996.6755 1034.1254 1037.5792 1046.9939 1053.9908 1055.9559 1069.1021 1074.0233 1092.5176 1117.2987 1120.4061 1139.7456 1161.3240 1164.9268 1184.6761 1191.1958 1207.1890 1216.0962 1242.3420 1249.6667 1254.4743 1282.0994 1293.3176 1302.6548 1338.6257 1355.2172 1367.5016 1388.1778 1400.1031 1402.4158 1411.8608 1420.8512 1464.2148 1472.4837 1474.1942 1476.7175 1481.1255 1489.2186 1492.9420 1494.3658 1533.3067 1536.4414 1565.6083 1586.7901 1597.4149 1598.3179 1598.7739 1697.6937 2943.4096 2987.2482 2995.9151 2997.1425 3008.2177 3059.3427 3066.5659 3093.3164 3106.7774 3134.2371 3137.8830 3162.8345 3165.5968 3172.0193 3267.4053 3362.8136 3412.4334 3529.4582 3549.9988 3629.2980
redmass: 3.4604 6.8112 5.7685 5.4927 6.2124 4.2205 4.9805 4.9315 4.0049 5.7736 3.7078 8.7404 10.2105 1.4856 4.7460 3.5623 5.4366 3.7913 4.5055 5.3573 5.9026 3.8676 8.7268 1.2861 2.5422 6.1590 7.5880 5.0300 4.6398 7.1210 6.0956 4.8080 3.5572 3.4473 6.1972 3.0634 6.2251 6.0656 8.0424 4.0897 7.6712 3.3196 4.8705 1.6895 1.7395 6.8952 4.5479 2.6578 7.2636 2.1667 5.8858 7.4694 4.1781 1.6331 3.9089 4.3688 1.5118 8.7199 1.2664 1.9763 3.8981 1.0956 2.6135 1.3461 2.6108 1.2514 1.7548 3.7274 4.1348 4.8696 1.3626 3.8731 1.3761 5.3593 1.5340 3.0495 3.8446 5.5334 2.4844 5.1867 1.4726 3.2040 2.3470 1.3241 1.4656 2.9338 3.1229 1.1367 1.1794 3.6852 2.5733 2.3013 1.1304 3.7466 1.1540 1.5051 1.2593 2.7758 1.3290 1.5350 6.7674 1.2654 2.7504 3.0136 2.8392 1.0406 2.1501 2.7281 1.1368 1.2060 1.1301 1.0981 1.9590 2.2316 1.0850 2.1776 4.6159 5.9710 5.8187 4.9053 8.9605 1.0573 1.1035 1.0357 1.0598 1.0580 1.1039 1.1069 1.0986 1.1027 1.0896 1.0895 1.0952 1.0966 1.0915 1.0801 1.0415 1.0512 1.0999 1.0761 1.0994
irintensity: 1.0091 0.5138 1.1058 1.1595 0.7662 0.0348 0.6957 1.0003 1.8810 0.6098 4.7073 0.0833 0.2626 35.3236 3.2919 1.4957 1.9110 3.1667 3.5147 3.8586 0.5489 3.9845 20.5498 2.3100 4.5293 4.0484 11.3665 2.2770 2.2810 3.1702 4.3862 1.3125 12.1303 0.1263 0.5984 0.1619 47.6389 41.5067 7.3987 124.2946 2.5973 66.6612 7.5293 53.6130 45.6175 0.0370 23.3460 1.2129 3.9919 142.0663 2.1738 8.3800 29.9286 54.1606 1.9093 10.5090 2.7790 3.8617 67.6517 117.1651 23.7534 4.1385 96.9259 22.8740 156.7171 1.5934 27.2609 2.0961 60.7678 102.5602 0.3449 24.0542 0.2686 2.8318 1.3579 141.9981 23.4182 41.5394 27.4593 430.6388 26.0930 360.6528 94.6955 3.3042 5.0181 54.7897 139.0550 4.4297 0.2376 76.5637 12.9317 219.0961 0.0089 313.3319 0.8982 5.3919 1.2857 32.7091 28.6869 109.5306 5.8167 43.8781 11.5337 55.8210 165.6493 12.3909 64.7417 223.8091 2.6477 20.0975 21.9324 44.6046 156.1835 550.8254 27.4272 4.5533 1452.2248 39.5221 69.4756 234.5611 252.2612 43.4293 17.8346 22.0567 20.7524 24.7185 17.3770 8.3835 31.7892 45.0894 9.7189 6.7653 0.1974 10.1560 6.5611 135.9574 26.3611 94.9864 24.7608 41.6558 95.1022
temp: 298.150 k
press: 1.00000 atm
elementType: 16 8 8 8 8 8 8 7 7 7 7 7 7 6 6 6 6 6 6 6 6 6 6 6 6 6 6 6 6 1 1 1 1 1 1 1 1 1 1 1 1 1 1 1 1 1 1 1 1
symmnumber: 1
zpe: 959146.4 jmol-1
zpe.correction: 0.365320 hartree
zpe.thermalcorrener: 0.395110 hartree
zpe.thermalcorrenthalpy: 0.396055 hartree
zpe.thermalcorrgfe: 0.298730 hartree
zpe.sumelectzpe: -1797.256461 hartree
zpe.sumelectthermal: -1797.226670 hartree
zpe.sumelectthermalent: -1797.225726 hartree
zpe.sumelectthermalfe: -1797.323051 hartree
dipole: 1.5411 6.1657 -0.4208
dipole: 6.3693
quadrupole: -236.3497 -174.1726 -175.1369
quadrupole: 7.6385 4.2022 -0.4249
quadrupole: -41.1300 21.0471 20.0829 7.6385 4.2022 -0.4249
hfenergy: -1797.6217809 hartree
pointgroup: C01 [X(C16H20N6O6S1)]
dipole: 0.7134293 -2.3977161 0.1461202 debye
polarizability: 373.9495142|16.1789609|344.5149979|-4.6547182|4.0207693|178.6231328 unknown
InChI: InChI=1S/C16H20N6O6S/c1-2-28-16(23)21-13-9-12(14(22(24)25)15(17)20-13)19-8-7-10-3-5-11(6-4-10)29(18,26)27/h3-6,9,19,21H,2,7-8,17-18H2,1H3
charge 0 multiplicity 1
49 atoms
S  -7.159026 -1.603099 0.02154
O  -8.010831 -1.24313 1.362444
O  -7.787853 -1.583322 -1.481151
O  4.357684 -3.766753 -0.043678
O  3.620309 4.666455 -0.012486
O  1.370393 4.364438 -0.008788
O  5.878939 -1.967847 -0.02314
N  0.351649 1.988524 -0.010596
N  4.336834 0.515792 -0.02222
N  2.589589 3.854542 -0.012059
N  3.494328 -1.696485 -0.025595
N  -6.480172 -3.299123 0.276319
N  5.245668 2.629564 -0.019193
C  -2.115566 1.996259 -0.017225
C  -0.83216 1.127711 -0.003471
C  -3.36591 1.131844 -0.008386
C  1.640374 1.522143 -0.012965
C  -4.038538 0.846761 1.208067
C  -3.8651 0.578515 -1.216984
C  -5.620519 -0.518228 0.012074
C  -5.179498 0.014892 1.232173
C  -5.003129 -0.2564 -1.220478
C  2.778224 2.440864 -0.014782
C  1.917259 0.129933 -0.01406
C  3.265044 -0.309211 -0.020049
C  4.116874 1.863723 -0.01857
C  4.710632 -2.395999 -0.02983
C  5.509696 -4.713172 -0.04907
C  4.922641 -6.120454 -0.081776
H  -2.0972 2.639655 -0.917366
H  -2.103179 2.664081 0.864175
H  -0.830496 0.456951 -0.888543
H  -0.835408 0.476428 0.896045
H  0.271634 3.022485 -0.008765
H  -3.675087 1.285893 2.144235
H  -3.369316 0.812614 -2.166369
H  -5.725702 -0.190087 2.158326
H  -5.417219 -0.666626 -2.147006
H  1.09855 -0.592691 -0.010372
H  2.671105 -2.302538 -0.029483
H  -6.742113 -3.869521 -0.545504
H  -6.8690 -3.664473 1.162133
H  6.136134 2.132336 -0.021816
H  5.147022 3.650891 -0.016914
H  6.135996 -4.495692 -0.933214
H  6.116305 -4.529377 0.856272
H  4.311186 -6.272649 -0.987608
H  4.290075 -6.305751 0.80316
H  5.739974 -6.864266 -0.085852
