program: Gaussian 09
title: 000267963
version: EM64L-G09RevD.01
frameworkgroup: C1[X(C20H28O8P2S)]
method: RPBEPBE
basis: SDD
operation: Freq
keyword: #p
keyword: freq=noraman
keyword: PBEPBE/SDD
title: #p freq=noraman PBEPBE/SDD
converged: YES YES NO NO
title: Mulliken charges:
elementType: S P P O O O O O O O O C C C C C C C C C C C C C C C C C C C C H H H H H H H H H H H H H H H H H H H H H H H H H H H H
charge: 0.250580 1.398372 1.397745 -0.541301 -0.540576 -0.504152 -0.512839 -0.504200 -0.513956 -0.616409 -0.616959 0.348861 0.346502 -0.248650 -0.249464 -0.316906 -0.314868 -0.362632 -0.362510 -0.134605 -0.133415 -0.233003 -0.232731 -0.217375 -0.264181 -0.217312 -0.259750 -0.657762 -0.645383 -0.657690 -0.645488 0.282042 0.282890 0.256196 0.256175 0.253970 0.252753 0.257991 0.258172 0.231659 0.239224 0.230821 0.232867 0.231572 0.239166 0.230228 0.234849 0.234455 0.237740 0.210379 0.220236 0.230418 0.263908 0.234549 0.237785 0.210399 0.220638 0.227418 0.263560
chargesum: 0.00000
title: Mulliken charges with hydrogens summed into heavy atoms:
elementType: S P P O O O O O O O O C C C C C C C C C C C C C C C C C C C C
charge: 0.250580 1.398372 1.397745 -0.541301 -0.540576 -0.504152 -0.512839 -0.504200 -0.513956 -0.616409 -0.616959 0.348861 0.346502 -0.248650 -0.249464 -0.034864 -0.031978 -0.106435 -0.106335 0.119365 0.119338 0.024988 0.025441 0.253507 0.199507 0.253426 0.205326 0.024811 0.069180 0.025042 0.066128
polarizability: 3.93632908e+02 -1.10652553e-01 3.16411247e+02 2.02760283e+01 -1.74575484e-02 2.33499666e+02
1716.lowfreq: -0.0019 -0.0015 -0.0015 4.0893 7.0841 10.4352 24.6182 25.3382 26.8362
frequency: 24.5852 25.2779 26.7872 29.5566 31.9071 35.9939 41.2943 42.0283 44.5772 48.0816 51.4673 55.1698 60.4887 66.0763 68.8481 75.0428 84.3274 101.3683 126.4005 132.1310 140.8544 179.8428 182.1173 192.4030 195.1725 206.6381 223.7163 235.4916 243.3779 244.4795 254.2639 256.8713 267.4071 271.4740 272.5460 283.5818 321.4429 342.9888 344.8038 358.8238 364.2197 372.2363 396.2369 399.6370 401.1488 412.2452 412.9867 434.3203 438.3434 458.4581 462.9881 505.8357 531.0821 565.5730 566.8936 613.4427 614.5776 626.9955 628.8642 682.0266 687.7452 705.7555 707.3469 708.7574 717.7401 797.7006 802.0317 812.1622 812.5333 817.2246 819.6432 823.3863 825.2137 837.0904 840.6341 853.9590 856.2576 879.1922 881.6230 949.1669 951.0147 963.4026 964.4404 994.7502 1001.3226 1002.9316 1007.1165 1014.2129 1014.6625 1048.8554 1049.8306 1060.9987 1077.9104 1094.3188 1096.2342 1100.1548 1100.4015 1107.4204 1107.4696 1131.9475 1132.3757 1140.6935 1144.0595 1159.7792 1163.7574 1187.7392 1188.4395 1254.1659 1254.6198 1269.5340 1270.9296 1285.1282 1285.6209 1352.1498 1354.1781 1355.8559 1356.3509 1357.8499 1364.4488 1395.6720 1396.1255 1396.3427 1396.7420 1401.5315 1402.7527 1456.9878 1457.0325 1459.2625 1462.9048 1463.7382 1465.9860 1469.3937 1471.5076 1478.2387 1478.6752 1478.7262 1488.1087 1488.5853 1488.8866 1577.5628 1580.9088 1591.0704 1593.2570 2981.5837 2983.0304 2996.1481 2996.3037 3008.5579 3008.5902 3015.3376 3015.4223 3075.0674 3075.1899 3075.2165 3076.1492 3082.6863 3083.2023 3093.1478 3093.2820 3106.2151 3108.0363 3115.3583 3115.5340 3149.2123 3149.5651 3150.1154 3150.2191 3170.9360 3171.1214 3175.6461 3175.6978
redmass: 4.9380 3.4581 3.1521 3.3629 4.6480 2.7907 3.8628 4.8085 3.2925 3.2328 3.5183 2.6920 3.8427 3.6336 3.5524 3.7773 3.1888 5.7402 6.2685 6.0810 5.9370 4.1283 4.0392 3.6545 4.6853 2.8988 2.3432 4.5564 2.3230 1.6196 1.4577 3.2551 1.5170 6.0741 2.5348 4.0733 5.6371 6.2642 5.6506 5.9879 6.3717 5.5826 4.8247 5.7500 4.5195 3.0239 3.1479 6.0278 6.3687 5.7909 6.2893 3.3912 3.3364 6.2880 6.5269 7.1224 6.9740 7.2845 7.4023 9.3197 8.5851 5.5232 5.8536 4.0245 4.1178 1.1275 1.1389 1.0915 1.0902 6.8864 2.9881 1.4189 1.4479 1.5454 1.6253 4.1489 4.4166 4.8915 4.8289 1.3467 1.3412 1.3654 1.3627 4.2884 3.8660 2.4977 2.5199 2.5525 2.5797 10.4591 10.7681 2.7712 2.8452 2.1161 2.0809 1.3532 1.3460 2.2559 2.2606 1.4017 1.4021 1.5446 1.5384 1.8435 1.8412 1.7119 1.7271 1.1508 1.1502 1.1234 1.1215 1.2536 1.2536 1.2169 1.2175 1.4739 1.2762 3.1113 5.5549 3.6529 1.2473 1.2480 3.4157 1.2679 1.2365 1.0393 1.0394 1.0530 1.8794 1.1641 1.0659 2.2922 1.0795 1.0616 1.0527 1.0530 1.0516 1.0845 1.0849 7.5034 7.7107 6.5470 6.4597 1.0365 1.0363 1.0362 1.0362 1.0571 1.0571 1.0601 1.0605 1.1054 1.1072 1.1031 1.1005 1.1000 1.1002 1.0976 1.0976 1.1056 1.1052 1.1031 1.1031 1.0892 1.0894 1.0889 1.0890 1.0966 1.0965 1.0971 1.0971
irintensity: 0.3530 2.4195 0.4893 0.1161 0.2257 1.2635 0.7300 1.3188 0.5279 0.2119 3.6952 3.3752 0.4275 2.8384 1.3232 0.0231 0.5768 0.6312 0.3500 0.3685 1.5240 1.7101 5.0228 0.1583 3.5207 2.0994 5.4157 3.1083 6.1700 0.0187 9.9841 0.4675 5.7772 7.7566 9.5948 10.0340 27.6042 37.9978 2.6289 0.1954 20.6545 0.1766 13.7596 2.3746 24.1973 0.8020 0.1368 2.8520 38.6510 5.6812 19.5272 19.9161 98.9260 4.8733 13.6398 35.3490 34.6013 4.2779 1.0139 41.6694 153.0333 179.3091 111.6977 18.4833 0.5438 7.3611 9.8840 3.0190 2.9446 37.7211 138.5043 44.1755 47.6899 92.9619 26.8906 120.3935 185.5158 544.5351 46.6048 3.5882 0.4781 0.1230 0.3404 10.5056 23.1669 301.0227 5.2281 200.7805 14.8649 114.3239 85.8478 29.5848 0.0705 0.3143 15.8269 24.4818 1.3468 2.6307 22.2143 4.3976 4.3809 11.1641 5.9929 98.0053 131.0951 37.4209 124.4648 0.2798 0.2703 0.1205 0.0787 2.1797 0.0591 11.6642 2.7600 6.2100 0.4293 0.6194 1.1323 5.5088 27.3040 26.3240 6.9320 12.0760 18.8151 12.2151 12.3016 1.0946 105.1735 12.1184 63.7157 141.4700 4.8148 3.1361 6.4657 6.9986 12.8035 9.0096 9.1639 3.5411 2.1755 1.7335 40.7491 4.9931 5.3390 21.7766 19.4756 28.1533 15.3775 37.4035 16.3908 1.0079 7.3873 11.2678 8.7782 9.6106 10.1135 24.3241 23.8199 71.0409 2.8240 33.6705 33.9333 1.1663 3.3644 5.3333 3.5068 1.2593 2.0800 6.3373 0.3375
temp: 298.150 k
press: 1.00000 atm
elementType: 16 15 15 8 8 8 8 8 8 8 8 6 6 6 6 6 6 6 6 6 6 6 6 6 6 6 6 6 6 6 6 1 1 1 1 1 1 1 1 1 1 1 1 1 1 1 1 1 1 1 1 1 1 1 1 1 1 1 1
symmnumber: 1
zpe: 1188589.4 jmol-1
zpe.correction: 0.452710 hartree
zpe.thermalcorrener: 0.489105 hartree
zpe.thermalcorrenthalpy: 0.490050 hartree
zpe.thermalcorrgfe: 0.378894 hartree
zpe.sumelectzpe: -2458.831972 hartree
zpe.sumelectthermal: -2458.795576 hartree
zpe.sumelectthermalent: -2458.794632 hartree
zpe.sumelectthermalfe: -2458.905787 hartree
dipole: -0.0361 -0.5413 0.0382
dipole: 0.5439
quadrupole: -173.2583 -212.6649 -206.0194
quadrupole: -0.1597 27.9517 -0.0865
quadrupole: 24.0559 -15.3507 -8.7052 -0.1597 27.9517 -0.0865
hfenergy: -2459.2846816 hartree
pointgroup: C01 [X(C20H28O8P2S1)]
dipole: 0.0141436 0.2131322 0.0127655 debye
polarizability: 393.8547597|-0.3313492|316.4014494|-19.3763587|-0.9034327|233.2876122 unknown
InChI: InChI=1S/C20H28O8P2S/c1-5-23-29(21,24-6-2)27-17-9-13-19(14-10-17)31-20-15-11-18(12-16-20)28-30(22,25-7-3)26-8-4/h9-16H,5-8H2,1-4H3
charge 0 multiplicity 1
59 atoms
S  -0.002782 -4.199728 0.049607
P  3.680364 1.833892 0.400818
P  -3.685075 1.82204 -0.458187
O  4.216863 0.160394 0.422772
O  -4.224378 0.149916 -0.412733
O  5.19691 2.591577 0.540094
O  3.205867 2.049616 -1.24403
O  -5.202383 2.577627 -0.598136
O  -3.17938 2.092658 1.168663
O  2.615272 2.285185 1.486177
O  -2.638081 2.229798 -1.577961
C  3.257372 -0.892096 0.393385
C  -3.264556 -0.901645 -0.361886
C  1.359089 -2.952469 0.239019
C  -1.366523 -2.958749 -0.165443
C  2.239485 -0.968204 1.37247
C  -2.251673 -1.003218 -1.344055
C  3.373693 -1.862586 -0.623057
C  -3.376358 -1.846412 0.679028
C  1.291938 -2.007751 1.289564
C  -1.304045 -2.040596 -1.239508
C  2.41648 -2.901169 -0.697518
C  -2.419262 -2.883429 0.774612
C  6.295109 2.27557 -0.438052
C  1.836448 2.603346 -1.54359
C  -6.282425 2.303256 0.412186
C  -1.806985 2.659627 1.43006
C  7.450182 3.19823 -0.068118
C  0.842882 1.478827 -1.822578
C  -7.448325 3.202268 0.018719
C  -0.858317 1.561977 1.903012
H  2.184429 -0.218434 2.167592
H  -2.200547 -0.274664 -2.158954
H  4.179615 -1.779992 -1.358048
H  -4.178476 -1.744833 1.4158
H  0.48409 -2.068501 2.025643
H  -0.49975 -2.120092 -1.977676
H  2.469815 -3.639604 -1.503808
H  -2.46907 -3.601468 1.599325
H  5.918796 2.462695 -1.460615
H  6.556635 1.20834 -0.327393
H  2.00912 3.235006 -2.430405
H  1.513243 3.235195 -0.695518
H  -5.889834 2.54033 1.418104
H  -6.540466 1.230857 0.356786
H  -1.983572 3.419743 2.209104
H  -1.441382 3.151404 0.509647
H  7.151777 4.255917 -0.160065
H  7.77828 3.014345 0.968536
H  8.304729 3.01298 -0.745304
H  1.181549 0.858624 -2.670585
H  0.718822 0.828126 -0.938816
H  -0.149705 1.904629 -2.065331
H  -7.153134 4.264289 0.053217
H  -7.79447 2.96654 -1.001424
H  -8.289429 3.047354 0.719934
H  -1.234645 1.090568 2.827208
H  -0.739476 0.77975 1.132288
H  0.142457 1.991837 2.100721
