program: Gaussian 09
title: 000267802
version: EM64L-G09RevD.01
frameworkgroup: C1[X(C15H20N6O4S)]
method: RPBEPBE
basis: SDD
operation: Freq
keyword: #p
keyword: freq=noraman
keyword: PBEPBE/SDD
title: #p freq=noraman PBEPBE/SDD
converged: YES YES NO NO
title: Mulliken charges:
elementType: S O O O O N N N N N N C C C C C C C C C C C C C C C H H H H H H H H H H H H H H H H H H H H
charge: 0.946205 -0.543425 -0.539902 -0.328265 -0.221834 -0.414905 -0.038753 -0.713455 -0.448014 -0.718085 -0.645506 -0.542579 0.429782 0.445683 -0.039369 -0.360483 -0.354661 -0.084963 -0.248213 -0.240810 -0.529926 0.236702 0.109831 0.258019 -0.253191 -0.661873 0.244627 0.235235 0.328666 0.280209 0.242239 0.283207 0.283883 0.235694 0.296630 0.298518 0.335888 0.334978 0.332997 0.296201 0.334699 0.218457 0.234213 0.224537 0.249530 0.211582
chargesum: 0.00000
title: Mulliken charges with hydrogens summed into heavy atoms:
elementType: S O O O O N N N N N N C C C C C C C C C C C C C C C
charge: 0.946205 -0.543425 -0.539902 -0.328265 -0.221834 -0.086240 -0.038753 -0.118307 -0.112126 -0.050110 -0.014606 -0.062716 0.429782 0.445683 -0.039369 -0.080274 -0.112422 -0.084963 0.034994 0.043072 -0.294232 0.236702 0.109831 0.258019 0.199480 0.023775
polarizability: 3.04403381e+02 -1.05480545e+01 2.75906523e+02 -2.71536615e+01 1.02092125e+01 2.01620291e+02
1716.lowfreq: -4.6858 -0.5655 0.0005 0.0011 0.0016 3.6903 6.6353 11.8971 13.9274
frequency: 5.4528 11.7782 13.5088 24.3911 33.2490 41.9221 55.0057 64.8090 88.5362 91.9381 101.2601 104.8821 130.2800 146.1377 164.8602 181.1747 204.4771 212.6225 221.7231 232.9699 247.9268 259.8888 268.2814 277.6473 280.7479 291.4406 304.9105 322.4208 335.1499 347.2468 361.4283 392.6252 408.3131 415.1305 419.9676 459.9007 483.7759 506.8327 511.1008 523.4412 529.7443 540.2112 581.0387 604.2360 616.8651 640.2665 644.9349 649.6244 665.5378 684.6096 698.9039 704.9751 719.0662 732.7465 772.6270 778.3314 794.2841 798.0767 802.8756 813.3610 828.1944 855.3429 863.3101 895.8550 906.3000 954.3743 969.3202 988.0181 994.4722 1003.6148 1031.4825 1038.5112 1053.6514 1069.7635 1082.8504 1095.8353 1113.4621 1123.0787 1143.4334 1154.4033 1158.9826 1178.4854 1198.8595 1216.3866 1233.4144 1269.6827 1282.4352 1284.1305 1326.5734 1343.1657 1357.1177 1388.9272 1391.5172 1396.9800 1405.9934 1419.8938 1444.3433 1455.4806 1459.2006 1462.0350 1472.3919 1483.6770 1493.0931 1533.6665 1538.3528 1580.7366 1589.9043 1594.5597 1601.6568 1604.0783 1628.7223 1699.6885 2945.4946 2989.7004 3019.0465 3023.3923 3085.0462 3086.8401 3113.4821 3125.1242 3148.7524 3151.7293 3162.0401 3169.8702 3362.1854 3455.3860 3469.6395 3529.5187 3552.7972 3554.3833 3570.2612 3712.1984
redmass: 6.9024 5.0739 4.8340 6.2770 3.3868 4.2622 5.4221 5.2284 4.0569 4.1223 6.2750 1.5101 6.1609 4.8629 4.3850 3.7521 1.4476 1.6270 5.4505 3.4300 2.8110 2.9690 2.6826 6.2397 4.7894 3.5673 3.2533 3.4704 4.7728 5.4176 5.4265 1.1606 2.8738 6.8465 3.7555 3.6278 2.2300 1.6982 4.0373 3.2210 1.1544 7.0639 4.1569 2.0807 5.7051 4.6466 4.3766 1.6177 5.6648 1.4270 3.5350 4.8222 3.7440 3.0077 4.5092 4.6641 2.8207 2.2763 1.1979 2.8583 1.4753 1.2668 3.7807 3.5607 4.0607 2.0771 1.6887 1.4393 4.9661 2.2403 3.5808 3.4958 2.4704 1.4825 3.8485 2.1869 1.3798 1.3049 2.5745 1.9943 1.9692 1.1363 2.0360 2.7446 2.3236 1.2584 1.1083 1.3019 1.6298 3.0187 1.3323 1.2454 5.2471 3.4945 2.5590 2.0901 2.9036 1.0994 1.3599 1.0470 2.0727 1.0569 3.1609 1.0852 2.8465 2.0279 6.2266 6.4095 5.3945 1.8842 1.2540 8.9407 1.0657 1.0360 1.0944 1.0594 1.0977 1.1032 1.1052 1.0896 1.0920 1.0881 1.0951 1.0966 1.0414 1.0452 1.0740 1.0999 1.0758 1.0441 1.1004 1.1047
irintensity: 0.4256 0.0694 1.2882 0.4652 2.7077 2.1642 0.5947 3.2108 0.3408 2.4205 0.0841 37.4610 2.3274 2.1676 1.8384 0.0491 9.8322 45.6473 9.8878 1.9468 21.4226 6.7924 1.9942 8.6907 11.6910 13.6426 5.0716 1.5538 10.5754 4.4229 0.2128 190.0540 0.1811 51.0724 18.3356 89.6242 31.8713 159.3574 63.8486 95.0403 42.3234 7.2911 7.5166 7.9989 2.5772 8.4297 14.1194 79.8660 5.0099 79.9436 9.9222 31.8743 12.0619 1.0586 17.9082 21.8885 29.5411 114.4385 2.2093 165.5891 33.3112 2.3864 0.6092 76.6262 59.0704 20.4562 19.7207 1.2777 3.6344 7.6899 206.4277 39.7855 39.1902 28.1666 315.4221 13.4875 7.6682 1.0642 206.5535 13.8053 23.5919 7.7034 17.6449 32.0198 29.7163 16.8439 3.5475 29.0205 37.0855 53.0457 2.0172 31.9562 12.0441 140.9559 14.0484 65.0312 102.5501 37.8545 19.2981 7.5569 14.0653 10.3017 736.5430 21.8855 90.5091 230.2507 391.6515 9.1195 51.8064 441.2982 189.6238 293.5356 40.8040 22.7306 15.6563 42.7081 42.6534 3.6209 35.4428 10.7624 10.5443 1.8646 2.8053 2.0594 27.5958 9.2551 78.3359 23.5474 33.1559 75.8795 7.5151 36.0148
temp: 298.150 k
press: 1.00000 atm
elementType: 16 8 8 8 8 7 7 7 7 7 7 6 6 6 6 6 6 6 6 6 6 6 6 6 6 6 1 1 1 1 1 1 1 1 1 1 1 1 1 1 1 1 1 1 1 1
symmnumber: 1
zpe: 922367.3 jmol-1
zpe.correction: 0.351311 hartree
zpe.thermalcorrener: 0.379234 hartree
zpe.thermalcorrenthalpy: 0.380178 hartree
zpe.thermalcorrgfe: 0.287280 hartree
zpe.sumelectzpe: -1608.980181 hartree
zpe.sumelectthermal: -1608.952258 hartree
zpe.sumelectthermalent: -1608.951314 hartree
zpe.sumelectthermalfe: -1609.044212 hartree
dipole: -0.9451 -7.3067 1.1409
dipole: 7.4553
quadrupole: -164.3016 -137.3789 -151.8797
quadrupole: 8.5803 -2.7401 9.4005
quadrupole: -13.1149 13.8079 -0.6930 8.5803 -2.7401 9.4005
hfenergy: -1609.3314918 hartree
pointgroup: C01 [X(C15H20N6O4S1)]
dipole: 1.0067197 2.4129777 1.3294636 debye
polarizability: 298.1400636|-22.9240126|283.229985|17.9714376|12.5325793|200.5601469 unknown
InChI: InChI=1S/C15H20N6O4S/c1-2-25-15(22)21-12-7-11(13(16)14(17)20-12)19-8-9-3-5-10(6-4-9)26(18,23)24/h3-7,19,21H,2,8,16-18H2,1H3
charge 0 multiplicity 1
46 atoms
S  4.702534 -2.401178 -1.476364
O  4.946068 -3.794969 -0.6676
O  4.068244 -2.330408 -2.9754
O  -4.370456 -2.583276 0.008512
O  -5.299888 -0.521317 -0.672958
N  0.509924 2.290895 1.548847
N  -3.381264 1.606814 0.020579
N  -0.98448 4.458134 0.745916
N  -3.135097 -0.738579 0.331875
N  6.349713 -1.573408 -1.562401
N  -3.677174 3.889575 -0.316424
C  1.372564 1.321523 2.204882
C  2.179754 0.405746 1.272197
C  -0.756421 2.017496 1.050352
C  3.697576 -1.260812 -0.369023
C  2.188404 0.602542 -0.128992
C  2.934702 -0.657847 1.831767
C  -1.545088 3.133494 0.622598
C  2.953506 -0.235686 -0.970785
C  3.70965 -1.505905 1.01351
C  -1.293917 0.706178 0.947233
C  -2.608824 0.573657 0.427587
C  -2.847897 2.867105 0.114644
C  -4.36122 -1.169215 -0.169189
C  -5.566988 -3.282229 -0.529701
C  -5.383719 -3.621199 -2.012521
H  2.08632 1.878139 2.842479
H  0.779261 0.68425 2.895524
H  0.716966 3.295593 1.583559
H  1.586097 1.410204 -0.555433
H  2.917482 -0.82827 2.915399
H  2.950324 -0.115982 -2.058895
H  4.282656 -2.342824 1.425025
H  -0.709388 -0.174212 1.229118
H  -1.411091 5.083144 1.435614
H  -0.694537 4.928642 -0.116072
H  -2.539212 -1.496547 0.670486
H  7.052933 -2.240853 -1.202782
H  6.516332 -1.301573 -2.546029
H  -3.371422 4.857325 -0.306643
H  -4.596239 3.632365 -0.668785
H  -5.646022 -4.187513 0.094293
H  -6.451007 -2.638096 -0.375496
H  -4.470226 -4.22065 -2.169693
H  -5.314904 -2.700031 -2.615566
H  -6.24953 -4.206941 -2.374541
