program: Gaussian 09
title: 000267740
version: EM64L-G09RevD.01
frameworkgroup: C1[X(C8H10N6O2)]
method: RPBEPBE
basis: SDD
operation: Freq
keyword: #p
keyword: freq=noraman
keyword: PBEPBE/SDD
title: #p freq=noraman PBEPBE/SDD
converged: YES YES NO NO
title: Mulliken charges:
elementType: O O N N N N N N C C C C C C C C H H H H H H H H H H
charge: -0.328832 -0.202542 0.064133 -0.447550 -0.058417 -0.007371 -0.347718 -0.667895 -0.092746 0.466293 0.240678 -0.169780 -0.519867 0.267221 -0.254138 -0.662464 0.220505 0.334473 0.358072 0.344652 0.316193 0.236861 0.219435 0.214367 0.221448 0.254988
chargesum: 0.00000
title: Mulliken charges with hydrogens summed into heavy atoms:
elementType: O O N N N N N N C C C C C C C C
charge: -0.328832 -0.202542 0.064133 -0.113077 -0.058417 -0.007371 0.010353 -0.007049 -0.092746 0.466293 0.240678 -0.169780 -0.299362 0.267221 0.202158 0.028340
polarizability: 2.23891572e+02 3.88175906e+00 1.49379576e+02 -4.88807755e+00 1.48684573e+00 6.71208842e+01
1716.lowfreq: -10.4730 -4.0396 -0.0006 0.0004 0.0005 3.1124 17.3903 40.7021 61.1929
frequency: 17.1185 40.6915 61.1701 89.4440 98.4496 161.8078 203.7147 206.7194 219.4940 243.9430 265.0933 282.4783 325.6675 378.3307 418.7960 444.9313 484.1341 494.8729 537.3709 587.0486 609.8967 617.9025 644.4034 648.1169 674.6333 679.8229 693.7971 708.4148 782.7119 791.8476 807.2671 822.3400 869.0372 923.1963 931.1516 988.6501 1034.6670 1057.1315 1088.8318 1095.8123 1106.4297 1133.2872 1157.6518 1167.4788 1208.3550 1282.7993 1295.4114 1315.3735 1354.0797 1368.4184 1391.0850 1419.8656 1446.4956 1456.3995 1463.6337 1478.8065 1484.4043 1516.0001 1596.2288 1606.4187 1642.0025 1704.0938 2991.2735 3024.8554 3086.0930 3089.4767 3115.6335 3131.7311 3552.0115 3555.1753 3620.1051 3696.4099
redmass: 4.8318 4.8736 4.5416 4.2272 4.1561 6.5739 4.5703 1.5067 4.3929 4.2515 2.7734 3.9632 4.4751 4.6367 3.5362 1.2861 7.0564 1.1046 6.3679 4.2126 6.0396 2.3251 2.3621 3.7819 5.2610 4.5869 1.2578 5.7285 4.4494 3.5577 1.3987 2.1473 4.2846 11.5831 4.7050 3.7262 3.1948 2.3036 4.1054 2.2055 6.0148 3.1722 1.7883 4.5894 1.7865 1.1085 9.9522 3.7367 1.3580 2.5244 1.2355 1.4612 8.7683 1.0864 1.0478 5.8830 1.0563 2.0971 3.3355 5.9911 1.4781 8.7290 1.0361 1.0597 1.0978 1.1032 1.1052 1.0919 1.0455 1.0755 1.0833 1.1048
irintensity: 0.1540 4.0441 1.8381 0.9843 0.4287 1.3459 13.6401 5.2303 0.0656 4.6180 0.1932 2.5109 14.9644 7.4146 4.6329 116.0924 0.3851 159.5262 8.8230 1.5290 5.5891 46.2596 9.4148 4.9463 8.2917 27.0971 109.6154 47.8575 8.4047 5.5781 0.6435 75.1307 2.2282 40.8592 68.8458 4.1165 210.2234 195.1438 206.3462 23.5533 13.8508 227.8269 2.1382 32.6541 72.4715 4.4609 2.7374 23.2240 21.8565 18.8197 30.6787 52.6813 78.2707 19.6027 9.9477 206.1800 12.7508 817.4158 154.1345 161.3840 378.2779 196.6072 23.0989 39.7253 39.5129 3.4237 36.5830 14.3946 105.7174 44.4366 167.2800 34.2454
temp: 298.150 k
press: 1.00000 atm
elementType: 8 8 7 7 7 7 7 7 6 6 6 6 6 6 6 6 1 1 1 1 1 1 1 1 1 1
symmnumber: 1
zpe: 511334.1 jmol-1
zpe.correction: 0.194757 hartree
zpe.thermalcorrener: 0.209305 hartree
zpe.thermalcorrenthalpy: 0.210250 hartree
zpe.thermalcorrgfe: 0.151434 hartree
zpe.sumelectzpe: -788.626131 hartree
zpe.sumelectthermal: -788.611582 hartree
zpe.sumelectthermalent: -788.610638 hartree
zpe.sumelectthermalfe: -788.669454 hartree
dipole: -2.0612 6.0354 0.5502
dipole: 6.4014
quadrupole: -62.8777 -84.0363 -94.9138
quadrupole: 0.6425 -0.5550 -0.7122
quadrupole: 17.7316 -3.4270 -14.3045 0.6425 -0.5550 -0.7122
hfenergy: -788.8208874 hartree
pointgroup: C01 [X(C8H10N6O2)]
dipole: 0.8336412 -2.3601961 -0.2780134 debye
dipolederiv: -2.0826953 -0.1154727 -0.0440373 -0.3995222 -0.5352713 -0.0825595 -0.2310217 -0.0629049 -0.4011693 -0.7783207 0.0904168 -0.0119733 0.3023778 -0.8351144 -0.0297316 0.0118546 -0.0727999 -0.305569 -0.8331751 -0.1996049 -0.1039409 -0.4313395 -0.6089738 -0.1274461 -0.1571378 -0.1077468 -0.2436371 -2.5544508 0.0995596 -0.178052 0.5927995 -0.4097384 0.0514953 -0.1421641 0.0059556 -0.38004 -0.3528815 0.1394942 0.0051997 0.4079554 -0.0652843 0.061713 0.0601696 0.0319814 -0.1243718 -0.0561006 0.3320995 0.0808033 -0.1967647 -0.2462858 -0.0394445 -0.0284164 0.0206286 -0.158624 -0.2711688 -0.5602573 -0.119347 -0.4557741 -0.0825617 -0.0252902 -0.103188 -0.0395781 -0.2285062 -0.9150389 0.6607319 0.1174878 0.7246899 -0.898091 0.0367645 0.124228 0.0347296 -0.6652022 -0.2379595 -0.1545411 -0.0597135 0.2066205 -0.2844239 -0.0406275 0.0125539 -0.0828549 0.0086271 1.3187515 -0.7092895 -0.0231807 -0.5952406 1.0408207 0.1140616 0.0091421 0.0985017 0.1905914 2.2005984 -0.0247052 0.200223 0.1913602 0.7055965 0.1306491 0.2657152 0.1134072 0.2216829 0.7812878 0.2576249 0.1270162 0.1552609 0.0695261 0.0097777 0.1142281 0.0232025 0.113839 -1.0777426 0.4138152 0.0069365 0.2685994 -0.1794896 0.0530773 -0.0382927 0.0708403 -0.2764204 2.9903282 -0.0909456 0.1789601 -0.52528 1.2647671 0.0422778 0.1873501 0.1430213 0.3349081 1.0736821 -0.0264965 -0.043128 -0.3181735 0.2509572 -0.0015564 -0.0491163 0.0395928 0.3610311 -0.1283111 -0.0033425 0.0485131 0.079778 0.0524116 -0.0141125 0.0696831 -0.0510892 -0.1491458 0.0434867 -0.0597859 -0.030927 -0.060004 -0.0852372 -0.0663378 -0.0308528 -0.0661997 0.1779775 0.2263222 0.0367403 -0.0104718 0.0422706 0.1613729 -0.0212985 0.0020675 -0.0242214 0.3198848 0.2992315 0.077389 0.0099744 0.0907025 0.2865896 -0.0025166 0.0133595 -0.0031842 0.345989 0.2664437 -0.0727181 -0.0292545 -0.0302907 0.1996334 -0.0414509 -0.0190721 -0.0464887 0.3682499 0.1500804 -0.0294791 -0.0338729 -0.0757393 0.2181684 -0.0429495 -0.0430922 -0.0386436 0.3711562 0.0162049 -0.0377291 0.0471745 0.0989228 -0.050827 0.1060229 0.0460856 0.0567922 0.0194279 -0.0932751 -0.0394919 -0.0629364 -0.0615022 0.0270163 -0.1152456 -0.0659542 -0.0786033 -0.0285616 -0.1778228 0.0964423 0.0052648 0.1178599 0.0738461 0.0069043 0.0329073 0.0169088 0.0900056 0.1239209 0.0012836 0.0122374 -0.0467023 -0.1075425 0.1083181 0.0289878 0.0661997 0.024169 0.0686043 -0.0817379 -0.0889555 -0.0828642 0.0381353 -0.0704941 -0.0700243 -0.0474469 0.0137083 unknown
polarizability: 222.7680534|1.9261939|145.8662193|14.1480752|16.8783699|71.7577591 unknown
InChI: InChI=1S/C8H10N6O2/c1-2-16-8(15)11-5-3-4(9)6-7(10-5)13-14-12-6/h3,11,14H,2,9H2,1H3
charge 0 multiplicity 1
26 atoms
O  -3.712999 -0.744224 -0.685002
O  -2.63677 1.302132 -0.202376
N  0.248292 0.756588 0.097379
N  -1.48547 -0.787513 -0.425679
N  3.83957 0.337491 0.429609
N  2.256963 2.080614 0.607669
N  3.562102 1.660732 0.673013
N  3.091224 -2.497711 -0.249421
C  2.576652 -0.153209 0.179462
C  2.158248 -1.487194 -0.14795
C  -0.117714 -0.504237 -0.210132
C  1.59708 0.900625 0.28431
C  0.772971 -1.637226 -0.342876
C  -2.584691 0.075805 -0.40437
C  -5.024264 -0.039735 -0.673742
C  -5.585734 0.057047 0.748138
H  0.358902 -2.618815 -0.599491
H  -1.731959 -1.757131 -0.632906
H  4.305564 2.319645 0.897053
H  4.073737 -2.286156 -0.090169
H  2.821082 -3.449399 -0.481404
H  -4.888688 0.963003 -1.116644
H  -5.658517 -0.6592 -1.328529
H  -6.594111 0.51091 0.722374
H  -5.668172 -0.942787 1.208746
H  -4.939697 0.690946 1.378439
