program: Gaussian 09
title: 000267767
version: EM64L-G09RevD.01
frameworkgroup: C1[X(C12H18O8)]
method: RPBEPBE
basis: SDD
operation: Freq
keyword: #pfreq=noraman
keyword: PBEPBE/SDD
title: #p freq=noraman PBEPBE/SDD
converged: YES YES NO NO
title: Mulliken charges:
elementType: O O O O O O O O C C C C C C C C C C C C H H H H H H H H H H H H H H H H H H
charge: -0.239555 -0.283125 -0.274399 -0.272369 -0.257215 -0.248990 -0.252592 -0.250000 -0.111788 -0.081564 -0.081175 -0.111700 -0.338257 0.338680 0.337506 -0.503999 0.302378 -0.765802 -0.767624 -0.751212 0.300488 0.309960 0.255017 0.253391 0.279408 0.251381 0.195491 0.271082 0.230779 0.272493 0.244479 0.244865 0.246192 0.248697 0.263685 0.251788 0.249054 0.244554
chargesum: 0.00000
title: Mulliken charges with hydrogens summed into heavy atoms:
elementType: O O O O O O O O C C C C C C C C C C C C
charge: -0.239555 -0.283125 -0.274399 -0.272369 -0.257215 -0.248990 -0.252592 -0.250000 0.188700 0.228396 0.173842 0.141691 0.192532 0.338680 0.337506 0.193353 0.302378 -0.003965 -0.009051 -0.005816
polarizability: 1.91204719e+02 8.25032609e+00 1.49263365e+02 -1.07670959e+00 1.11743942e+00 1.23551549e+02
1716.lowfreq: -4.8748 0.0004 0.0007 0.0009 4.6337 7.3037 23.2469 29.7391 36.0067
frequency: 23.1230 29.7280 35.9307 44.5626 49.7753 57.7359 68.7352 75.2440 81.1605 87.3747 95.5721 100.9551 117.0371 136.4178 155.1378 157.4812 194.4665 228.9803 244.8249 261.5895 286.5707 296.8847 300.7438 347.6282 402.1438 412.6585 466.4321 473.6286 504.6616 547.8733 559.9432 561.0588 566.7585 579.3219 609.1201 622.7225 710.1152 734.5343 788.2939 804.3119 824.2226 846.8473 870.5073 894.3915 934.2067 959.8752 980.6573 993.3923 1001.1210 1008.0654 1020.3820 1026.0750 1042.3132 1042.9137 1044.1338 1051.7487 1059.2258 1100.6532 1124.0572 1147.3487 1154.8513 1179.5821 1195.4771 1204.0186 1226.6201 1233.6626 1247.3157 1269.2329 1290.9371 1311.4296 1320.1971 1336.5391 1360.3558 1369.2223 1384.0116 1384.7545 1385.0473 1435.8467 1450.5695 1453.1438 1453.5733 1453.9469 1454.5808 1454.9725 1455.5219 1456.0652 1475.5172 1656.6544 1657.1600 1666.8090 2964.8572 3006.1811 3006.3173 3007.7845 3023.0878 3042.0804 3045.3590 3067.1417 3070.4184 3084.7715 3100.0098 3101.1099 3101.2377 3122.7541 3132.7285 3141.8140 3142.0641 3142.4707
redmass: 5.6591 4.5277 5.0107 1.2298 3.8203 4.0882 3.2973 1.2023 3.6498 3.8113 3.6011 1.1215 3.4849 1.4435 3.1862 4.1288 7.0495 6.0693 3.7983 4.1240 7.2851 4.6585 3.5902 4.2159 3.6417 3.6441 4.2158 3.0511 4.4626 4.4188 3.2675 3.3638 3.3579 5.7835 4.6987 5.4616 4.4395 5.7483 3.7606 4.9987 6.0073 5.5736 5.4867 3.9428 5.0288 4.1238 3.0790 2.0056 2.7069 2.4814 3.3435 4.5349 1.7015 1.6990 1.6677 2.2551 5.1019 2.4341 1.2777 3.4947 1.4253 3.1261 3.3432 3.4444 1.2376 1.2193 1.3768 1.3699 1.2490 1.2637 1.2180 1.3778 1.4011 1.3520 1.2539 1.2428 1.2446 1.1377 1.0833 1.0577 1.0595 1.0537 1.0539 1.0522 1.0581 1.0540 1.0541 9.5950 9.5492 10.2744 1.0383 1.0386 1.0384 1.0376 1.0870 1.0587 1.0840 1.0868 1.0846 1.0935 1.0955 1.0937 1.0937 1.1076 1.1042 1.1026 1.1025 1.1019
irintensity: 0.7774 1.8810 6.9803 0.2069 1.0179 0.6445 4.1811 0.8353 1.0197 1.1229 0.2320 0.3195 1.0791 5.4723 6.9631 2.9334 1.6055 7.4307 7.7240 13.8026 7.9921 3.0684 10.3509 5.3212 4.3633 19.9905 3.2669 10.6433 21.5808 8.9672 3.9330 5.3952 12.7832 4.6402 0.7527 7.1493 12.0409 7.0627 19.2505 1.4146 12.9481 64.7753 119.6038 44.1131 74.8865 38.6157 0.3205 18.9376 30.1438 158.6097 28.5357 203.0607 11.0052 16.1421 17.2157 6.5728 45.2252 6.3084 1.4274 8.7933 10.7491 133.7709 755.7330 62.5573 8.2422 73.7820 1.3707 3.2134 3.7054 2.9433 20.3002 6.8272 1.5961 2.0939 81.0111 36.8272 66.5631 10.0998 11.9485 20.5623 52.7902 10.1252 6.9596 28.5788 3.8064 7.5943 19.7061 238.3154 179.1276 135.0088 75.2620 1.2360 0.6106 2.3385 34.7176 14.3764 6.3829 13.2097 4.6299 22.3164 8.8867 14.3781 0.5423 3.6984 15.2682 5.8223 10.3944 9.0236
temp: 298.150 k
press: 1.00000 atm
elementType: 8 8 8 8 8 8 8 8 6 6 6 6 6 6 6 6 6 6 6 6 1 1 1 1 1 1 1 1 1 1 1 1 1 1 1 1 1 1
symmnumber: 1
zpe: 774421.6 jmol-1
zpe.correction: 0.294962 hartree
zpe.thermalcorrener: 0.317803 hartree
zpe.thermalcorrenthalpy: 0.318747 hartree
zpe.thermalcorrgfe: 0.239318 hartree
zpe.sumelectzpe: -1068.293939 hartree
zpe.sumelectthermal: -1068.271098 hartree
zpe.sumelectthermalent: -1068.270154 hartree
zpe.sumelectthermalfe: -1068.349583 hartree
dipole: -0.3929 0.5420 -0.9869
dipole: 1.1925
quadrupole: -110.1734 -104.7411 -121.6745
quadrupole: -7.3788 3.8044 5.7702
quadrupole: 2.0230 7.4552 -9.4782 -7.3788 3.8044 5.7702
hfenergy: -1068.588901 hartree
pointgroup: C01 [X(C12H18O8)]
dipole: -0.2645532 0.1461174 0.3588772 debye
polarizability: 178.697049|-9.6085475|142.0326379|19.5198699|-18.1675595|143.2899459 unknown
InChI: InChI=1S/C12H18O8/c1-6(13)17-5-9-10(18-7(2)14)11(19-8(3)15)12(16-4)20-9/h9-12H,5H2,1-4H3
charge 0 multiplicity 1
38 atoms
O  -0.876402 1.723391 -0.153947
O  0.368091 -1.505331 1.02992
O  2.440108 1.065836 0.15378
O  0.03045 1.036088 -2.319131
O  -3.411543 -0.151672 -0.042069
O  1.888204 -1.280556 2.795072
O  3.488552 -1.016421 -0.008714
O  -3.574995 0.594598 -2.254082
C  0.318995 -0.037755 0.883719
C  1.175078 0.449659 -0.310041
C  -1.12113 0.450588 0.571378
C  0.328926 1.535625 -0.998881
C  -1.985424 -0.539067 -0.225533
C  1.263157 -2.013754 2.002153
C  3.543072 0.196594 0.28615
C  -0.733303 1.983394 -3.154967
C  -4.083655 0.435419 -1.123133
C  1.349642 -3.513777 1.893206
C  4.729213 0.935536 0.853568
C  -5.479331 0.843141 -0.703856
H  0.690293 0.434151 1.811025
H  1.397404 -0.37934 -1.002887
H  -1.663529 0.731323 1.489608
H  0.814701 2.528911 -1.036697
H  -1.727625 -0.534823 -1.297968
H  -1.900982 -1.551596 0.198635
H  -0.202176 2.954879 -3.221629
H  -1.74922 2.122444 -2.751642
H  -0.790912 1.515811 -4.149061
H  2.115586 -3.759094 1.134244
H  0.393076 -3.948885 1.56517
H  1.66324 -3.942977 2.85644
H  5.661585 0.459834 0.513716
H  4.710083 1.999393 0.572773
H  4.690321 0.868519 1.956658
H  -5.425596 1.770362 -0.105031
H  -5.940843 0.066006 -0.073806
H  -6.094513 1.030643 -1.595941
