program: Gaussian 09
title: 000267748
version: EM64L-G09RevD.01
frameworkgroup: C1[X(C10H12FN3O4S)]
method: RPBEPBE
basis: SDD
operation: Freq
keyword: #p
keyword: freq=noraman
keyword: PBEPBE/SDD
title: #p freq=noraman PBEPBE/SDD
converged: YES YES NO NO
title: Mulliken charges:
elementType: S F O O O O N N N C C C C C C C C C C H H H H H H H H H H H H
charge: 1.012300 -0.229391 -0.474641 -0.523994 -0.253917 -0.237137 -0.661950 -0.155579 0.055715 -0.055037 -0.185842 -0.251112 0.453521 -0.372034 -0.360776 -0.399409 0.453939 -0.797089 -0.176725 0.298483 0.290771 0.387038 0.247903 0.247570 0.248388 0.282905 0.231419 0.246953 0.232609 0.212010 0.233111
chargesum: 0.00000
title: Mulliken charges with hydrogens summed into heavy atoms:
elementType: S F O O O O N N N C C C C C C C C C C
charge: 1.012300 -0.229391 -0.474641 -0.523994 -0.253917 -0.237137 -0.274912 -0.155579 0.055715 -0.055037 0.112641 0.039659 0.453521 -0.124131 -0.113206 0.131884 0.453939 -0.086107 0.268396
polarizability: 2.12605555e+02 2.61876495e+01 1.63939243e+02 -3.22437720e-01 1.50971383e+01 1.47698518e+02
1716.lowfreq: -4.8019 -0.0021 -0.0007 0.0016 3.6196 7.8491 20.8941 25.9873 38.1001
frequency: 20.8589 25.9362 38.0461 45.2597 57.3367 63.1110 79.3793 98.1026 118.8858 132.6848 142.4464 175.1883 202.7183 221.5205 228.5607 255.4465 281.2213 310.2109 318.3835 325.7567 371.5082 382.0193 404.6464 407.0581 429.5208 470.9971 504.5157 515.1032 580.8431 618.0676 619.6402 655.1125 702.6580 705.5988 737.4250 775.0788 791.9211 819.7269 824.3525 833.2028 841.2796 931.4193 957.5257 965.8075 973.4366 980.4457 988.9389 992.5348 1026.3245 1048.5506 1049.3266 1074.4177 1119.3056 1123.9249 1188.8296 1203.7723 1212.0351 1219.6842 1297.2766 1300.9086 1340.5558 1357.8316 1376.5964 1383.0375 1384.1926 1393.2234 1398.2250 1423.2678 1468.6779 1470.1203 1470.8857 1473.7032 1591.5150 1594.4613 1642.2224 2981.6962 3020.3430 3031.6698 3064.9533 3094.4156 3102.7426 3116.7623 3139.9762 3143.9212 3166.0101 3182.1485 3469.5260
redmass: 5.8399 7.6719 1.0164 5.4347 5.4488 9.4434 6.4503 6.0215 9.5233 6.8851 6.9486 4.1843 7.8089 8.6100 7.7024 8.8040 6.8337 4.2025 5.6976 3.5691 3.9092 3.9989 6.1821 3.1765 10.3688 10.6429 3.0411 3.0740 5.7388 1.5607 6.8114 2.4903 5.3960 4.1653 5.1708 4.7585 5.0818 3.8428 1.5308 5.0113 1.2550 4.1631 1.3212 2.7802 4.1406 1.4067 5.7642 1.5613 3.6290 2.4095 1.6067 2.1610 2.1009 1.2982 1.1334 2.1792 1.4504 3.0903 1.3609 1.2570 3.2365 2.0164 1.3115 4.0125 2.7044 2.7767 1.2175 1.1419 1.0884 1.1343 2.1493 1.0684 5.9455 6.9635 10.8005 1.0390 1.0606 1.0600 1.0947 1.1002 1.1056 1.1033 1.0894 1.0905 1.0961 1.0956 1.0784
irintensity: 1.3935 1.3617 0.4398 1.2398 1.4123 2.0122 1.2695 1.5447 7.3504 2.5518 4.0611 2.6145 14.0299 3.8257 8.5720 7.3302 33.3426 2.6045 18.2070 0.9538 1.8666 0.2273 22.1226 4.5414 112.5215 6.9569 46.6065 60.3988 11.5086 72.1949 0.7316 158.5848 10.7314 6.7870 74.6459 10.6714 11.4591 137.8972 9.2003 39.2096 6.5325 206.5595 0.8484 28.4612 98.3207 0.9148 0.3520 12.4313 18.6380 32.0864 15.6618 53.9274 0.8723 7.2353 13.7858 11.1466 16.0504 6.6573 51.4958 3.4185 534.2462 49.8306 16.4697 14.8342 20.4703 15.2199 17.9442 58.1715 4.9420 18.7408 20.8304 13.3419 17.3446 0.6202 178.7134 19.1461 2.8033 46.2655 18.7833 13.7910 9.3550 7.2562 10.7483 7.5564 5.3611 5.3861 119.0483
temp: 298.150 k
press: 1.00000 atm
elementType: 16 9 8 8 8 8 7 7 7 6 6 6 6 6 6 6 6 6 6 1 1 1 1 1 1 1 1 1 1 1 1
symmnumber: 1
zpe: 574617.1 jmol-1
zpe.correction: 0.218860 hartree
zpe.thermalcorrener: 0.238918 hartree
zpe.thermalcorrenthalpy: 0.239863 hartree
zpe.thermalcorrgfe: 0.167152 hartree
zpe.sumelectzpe: -1349.663048 hartree
zpe.sumelectthermal: -1349.642990 hartree
zpe.sumelectthermalent: -1349.642046 hartree
zpe.sumelectthermalfe: -1349.714756 hartree
dipole: 1.2629 5.3667 -0.3200
dipole: 5.5226
quadrupole: -94.0263 -130.3195 -119.2783
quadrupole: 5.0111 -11.0047 3.6098
quadrupole: 20.5151 -15.7782 -4.7369 5.0111 -11.0047 3.6098
hfenergy: -1349.8819083 hartree
pointgroup: C01 [X(C10H12F1N3O4S1)]
dipole: -0.5206566 2.1064033 0.1130886 debye
polarizability: 213.1483478|-25.4809859|163.2952321|0.7061902|-15.456697|147.7997356 unknown
InChI: InChI=1S/C10H12FN3O4S/c1-8-2-4-9(5-3-8)19(17,18)12-10(15)14(13-16)7-6-11/h2-5,12H,6-7H2,1H3
charge 0 multiplicity 1
31 atoms
S  -0.694685 -2.111122 -0.124467
F  2.490426 2.874781 0.43069
O  -0.617093 -2.654416 -1.641486
O  -0.893309 -3.11648 1.131747
O  1.02456 0.227019 -1.423979
O  4.65182 -0.541356 1.296415
N  0.95263 -1.330606 0.330707
N  2.907428 -0.042853 -0.032512
N  3.450643 -0.839183 0.979665
C  -1.916165 -0.688784 0.007262
C  -2.12277 0.130622 -1.112934
C  -2.604516 -0.554981 1.223497
C  -3.808323 1.350107 0.21867
C  -3.085277 1.155581 -0.988888
C  -3.559086 0.480701 1.314487
C  3.658249 1.047517 -0.688264
C  1.546378 -0.365473 -0.446924
C  -4.813638 2.479129 0.342078
C  3.808051 2.288567 0.198066
H  -1.554603 -0.021382 -2.034315
H  -2.415835 -1.244539 2.05231
H  1.473676 -1.815459 1.074337
H  -3.272079 1.815656 -1.843062
H  -4.118948 0.610963 2.247294
H  4.666321 0.66862 -0.941049
H  3.106947 1.29567 -1.609158
H  -5.617409 2.232692 1.056934
H  -4.320724 3.401448 0.70581
H  -5.277863 2.717772 -0.630225
H  4.418522 3.046798 -0.324568
H  4.241572 2.052888 1.183663
