program: Gaussian 09
title: 000267766
version: EM64L-G09RevD.01
frameworkgroup: C1[X(C13H17NO3S)]
method: RPBEPBE
basis: SDD
operation: Freq
keyword: #p
keyword: freq=noraman
keyword: PBEPBE/SDD
title: #p freq=noraman PBEPBE/SDD
converged: YES YES NO NO
title: Mulliken charges:
elementType: S O O O N C C C C C C C C C C C C C H H H H H H H H H H H H H H H H H
charge: 0.014638 -0.319475 -0.295300 -0.255216 -0.035499 0.183018 0.149747 0.270345 0.533140 -0.572780 -0.470842 -0.782052 -0.814650 0.149980 -0.193018 -0.646739 -0.606587 -0.500394 0.280670 0.266322 0.238329 0.246911 0.250786 0.239349 0.227615 0.227508 0.235928 0.287261 0.234610 0.265081 0.216927 0.262466 0.239780 0.241780 0.230358
chargesum: 0.00000
title: Mulliken charges with hydrogens summed into heavy atoms:
elementType: S O O O N C C C C C C C C C C C C C
charge: 0.014638 -0.319475 -0.295300 -0.255216 -0.035499 0.183018 0.149747 0.270345 0.533140 -0.292110 -0.204519 -0.046025 -0.120178 0.149980 -0.193018 0.111060 0.137888 0.211525
polarizability: 2.47288423e+02 5.33974221e+00 1.84347154e+02 9.14193746e+00 6.70708148e+00 1.23883983e+02
1716.lowfreq: -12.4468 -6.7070 -2.6741 -0.0019 -0.0018 -0.0015 13.5435 26.0699 28.9936
frequency: 13.4387 25.9556 28.8467 31.6961 54.7961 55.5553 89.6512 101.0027 112.1848 117.7490 129.1752 144.5171 149.3764 190.0292 196.7907 227.9293 238.3709 270.4154 287.9812 309.9468 326.9715 331.4352 376.4857 389.8567 428.5590 463.9593 476.3062 507.4053 545.7608 565.1024 581.8731 631.7465 666.2864 703.7394 719.0045 755.7161 757.8542 836.9963 883.8520 908.9703 934.9976 946.6312 975.1593 1012.2858 1026.7530 1039.2528 1050.4584 1053.7660 1070.7179 1090.9733 1101.3631 1113.5653 1137.8851 1145.4852 1161.6197 1176.1959 1215.7994 1241.0027 1254.0808 1290.4828 1369.6144 1396.4974 1398.4967 1399.6445 1405.9716 1423.9591 1425.8280 1447.7046 1449.3495 1451.4653 1462.1263 1463.4995 1464.6567 1471.2470 1477.8378 1478.8810 1481.3956 1486.8753 1520.4696 1573.5612 1610.0038 1628.6986 2977.1152 2979.8329 2990.1186 3001.6076 3004.3404 3052.5341 3058.6915 3075.9472 3080.5940 3089.3173 3101.7989 3107.6464 3119.5102 3144.6471 3152.6275 3152.9665 3175.0517
redmass: 4.9540 5.2749 2.1119 1.7837 3.7881 1.0370 3.8428 1.7926 1.2845 1.3644 2.1612 3.4456 1.1078 4.2373 4.8565 4.4886 2.8078 3.2708 5.3035 4.6126 3.5238 3.9398 3.9332 7.0902 3.4783 5.0065 4.8936 4.2708 4.3885 3.8465 9.9051 6.3709 6.8482 4.7008 5.9626 4.2555 4.3476 6.0133 1.5125 4.1940 1.3961 2.6990 4.9452 1.4883 2.4171 1.5448 1.5220 1.5542 6.3973 1.2256 4.0032 1.2634 1.3640 1.4601 1.8888 3.1737 2.1491 1.6328 3.8026 7.6157 4.4867 2.0015 1.7092 1.2243 1.7788 1.2029 1.1320 1.2440 1.0426 1.0501 1.0719 1.1132 1.0528 1.0461 1.3669 1.0684 2.0204 1.0475 1.9194 6.0995 8.2014 7.6375 1.0372 1.0373 1.0339 1.0296 1.0370 1.1019 1.0977 1.1013 1.0960 1.0988 1.1043 1.1018 1.1000 1.1045 1.0958 1.0927 1.0916
irintensity: 0.3854 2.4810 1.3507 1.6251 1.7416 0.6747 0.6732 0.2056 2.3222 0.0633 4.3093 1.6185 0.5871 3.2819 0.2594 2.0419 5.8322 3.2751 12.3369 3.1890 0.7577 0.2509 14.2888 2.9548 4.3806 1.8656 10.0003 2.9380 5.7930 1.0986 2.7431 6.8939 1.2847 1.4553 4.1563 8.4616 2.4866 43.4027 10.9140 0.8600 6.2377 1.2878 8.9190 21.6486 209.9902 10.9208 132.4124 12.7457 335.9781 0.1168 82.1427 0.2216 0.5934 67.6437 141.2942 143.4067 1.3844 21.5751 116.5855 259.7760 8.7693 101.0793 11.1375 4.7484 29.3982 27.3762 12.0733 0.5028 18.6909 13.0653 6.7306 24.1903 10.8477 14.4912 2.5708 12.4397 92.6264 8.7724 229.2442 21.1386 175.4364 34.4177 53.8007 32.9911 62.4994 46.5970 10.6764 28.4741 17.7953 15.7761 7.4211 17.2695 28.1272 21.6751 19.4182 17.4451 2.7708 4.6057 2.0765
temp: 298.150 k
press: 1.00000 atm
elementType: 16 8 8 8 7 6 6 6 6 6 6 6 6 6 6 6 6 6 1 1 1 1 1 1 1 1 1 1 1 1 1 1 1 1 1
symmnumber: 1
zpe: 725079.9 jmol-1
zpe.correction: 0.276168 hartree
zpe.thermalcorrener: 0.297014 hartree
zpe.thermalcorrenthalpy: 0.297958 hartree
zpe.thermalcorrgfe: 0.222668 hartree
zpe.sumelectzpe: -1182.717044 hartree
zpe.sumelectthermal: -1182.696199 hartree
zpe.sumelectthermalent: -1182.695255 hartree
zpe.sumelectthermalfe: -1182.770544 hartree
dipole: -1.5239 0.2099 -2.7679
dipole: 3.1666
quadrupole: -81.6059 -110.9747 -117.4982
quadrupole: 11.1230 9.7011 -1.6505
quadrupole: 21.7537 -7.6151 -14.1386 11.1230 9.7011 -1.6505
hfenergy: -1182.9932124 hartree
pointgroup: C01 [X(C13H17N1O3S1)]
dipole: -0.5526422 0.4619187 -1.0165337 debye
polarizability: 246.7979456|-2.9891413|174.2435277|13.8964164|22.7853558|134.4780866 unknown
InChI: InChI=1S/C13H17NO3S/c1-8-6-10(12(15)16-5)9(2)11(7-8)17-13(18)14(3)4/h6-7H,1-5H3
charge 0 multiplicity 1
35 atoms
S  -2.869099 0.271877 1.963655
O  -1.924354 -0.087118 -0.614194
O  4.082988 -0.595342 0.409382
O  2.840141 -2.429211 -0.283423
N  -4.175968 -0.363455 -0.355755
C  0.402479 -0.707633 -0.239715
C  1.728694 -0.258331 0.069412
C  -0.607725 0.285918 -0.197564
C  0.943496 2.059064 0.45096
C  1.97664 1.100155 0.409512
C  -0.366622 1.630566 0.131849
C  0.051319 -2.139451 -0.589647
C  1.215266 3.503101 0.830369
C  2.875618 -1.212859 0.034589
C  -3.008537 -0.06205 0.294811
C  -4.264514 -0.646366 -1.804022
C  -5.427136 -0.426513 0.425062
C  5.26956 -1.478068 0.396796
H  3.003303 1.393834 0.642273
H  -1.205067 2.334351 0.145468
H  -1.032571 -2.240251 -0.749731
H  0.585423 -2.472606 -1.496366
H  0.367649 -2.829974 0.210633
H  0.710023 3.766329 1.778684
H  2.29485 3.687468 0.961943
H  0.84284 4.201339 0.057975
H  -4.625398 -1.678934 -1.970431
H  -3.275658 -0.533067 -2.264988
H  -4.970732 0.057098 -2.283229
H  -5.347175 -1.178883 1.229284
H  -6.251391 -0.695324 -0.255467
H  -5.639092 0.546896 0.901716
H  5.448133 -1.868359 -0.619635
H  5.124983 -2.327267 1.085886
H  6.099034 -0.836333 0.726205
