program: Gaussian 09
title: 000267743
version: EM64L-G09RevD.01
frameworkgroup: C1[X(C12H12ClN5O2)]
method: RPBEPBE
basis: SDD
operation: Freq
keyword: #p
keyword: freq=noraman
keyword: PBEPBE/SDD
title: #p freq=noraman PBEPBE/SDD
converged: YES YES NO NO
title: Mulliken charges:
elementType: Cl O O N N N N N C C C C C C C C C C C C H H H H H H H H H H H H
charge: -0.043974 -0.279619 -0.280387 -0.368350 -0.356351 -0.023719 -0.653935 0.058664 0.481259 -0.482016 -0.394089 -0.355507 0.176996 0.293153 -0.224194 -0.227778 -0.231888 0.343416 -0.280604 -0.362281 0.223371 0.246606 0.231320 0.268768 0.227365 0.229934 0.321845 0.230035 0.342137 0.252325 0.323190 0.314309
chargesum: 0.00000
title: Mulliken charges with hydrogens summed into heavy atoms:
elementType: Cl O O N N N N N C C C C C C C C C C C C
charge: -0.043974 -0.279619 -0.280387 -0.046505 -0.014214 -0.023719 -0.016436 0.058664 0.481259 -0.012039 -0.162770 -0.086738 0.176996 0.293153 0.003171 0.002155 -0.001853 0.343416 -0.280604 -0.109956
polarizability: 2.26742028e+02 4.06344254e+00 1.93984729e+02 -3.91851918e+01 -1.57428860e+00 1.14223060e+02
1716.lowfreq: -7.4200 -3.6351 -0.0024 -0.0022 -0.0019 1.6605 14.1159 17.5690 27.0772
frequency: 14.0136 17.5272 27.0347 41.1301 51.8171 75.4536 99.0648 147.8781 180.6182 191.3784 221.3749 241.5632 252.7698 256.2412 317.8823 324.9013 351.5803 364.2121 393.6466 402.5542 444.8316 484.4558 488.7018 531.7235 540.0343 558.3429 569.3260 588.9836 604.1679 616.5759 619.6681 666.2631 692.6589 703.6059 724.4926 760.0999 763.6830 792.2242 815.4872 857.8235 865.8688 882.6446 895.1609 932.1780 953.8880 981.5271 987.5818 991.8348 1001.1797 1027.2218 1071.9667 1091.9822 1138.5120 1163.9781 1173.6986 1189.9211 1194.3616 1222.9418 1237.9269 1260.2983 1295.1802 1324.9551 1331.0088 1348.4739 1386.1440 1394.8885 1428.9382 1443.0530 1447.8838 1464.4696 1467.9661 1485.0565 1523.1029 1565.3221 1594.9047 1615.3550 1629.2495 1662.2164 3036.0709 3111.5961 3119.3416 3128.3620 3140.1238 3151.1517 3165.1626 3188.9921 3490.7295 3514.0189 3568.6286 3651.2096
redmass: 7.5339 4.6646 5.8736 5.6634 6.6743 9.0079 6.7508 6.0283 8.0681 5.5380 7.1076 5.1815 5.2013 3.6503 3.0176 3.5299 1.8402 5.9589 2.4477 2.8088 4.2292 2.1510 2.1422 5.2640 1.9449 1.5941 2.7235 4.2724 5.5993 5.2764 3.7668 5.4223 7.0757 1.9436 4.2649 4.0005 3.2036 9.1778 3.4994 1.2739 4.7363 4.2750 1.4413 1.5212 2.9630 1.4745 2.7048 4.2994 1.3403 2.2131 1.9617 1.5210 5.8483 4.6438 1.0545 1.2141 2.7859 2.8011 1.1633 2.9725 6.9198 3.5309 1.2557 1.2391 7.9994 1.7945 1.9253 2.1949 4.0655 1.1459 1.8019 2.2852 2.6573 4.6779 6.0929 6.0473 1.3037 7.8234 1.0588 1.1071 1.0869 1.0873 1.0919 1.0965 1.1016 1.0929 1.0767 1.0454 1.0786 1.1025
irintensity: 0.6630 1.4179 0.4935 0.6940 0.3944 6.6673 2.8764 1.1751 1.2760 0.5983 0.7678 2.4294 2.5445 14.8514 13.7367 15.1712 34.8723 12.1052 22.5555 0.2909 6.9723 1.3261 28.5858 4.2563 81.4754 228.1155 116.9221 24.7513 0.9191 17.4784 44.2509 57.2216 4.6444 49.0675 64.4794 22.1524 31.2564 22.3000 9.0705 1.1823 77.9573 0.4318 15.3394 14.3327 60.2901 3.9600 41.2677 20.6223 1.4072 2.9501 142.8016 7.5351 174.4502 282.9774 0.3777 3.5845 52.9132 26.8309 8.1406 39.1208 22.9715 25.1449 1.7962 11.8777 0.7221 68.5940 37.3399 12.4354 199.3436 24.6611 199.8881 9.8251 245.9236 9.9784 1.4917 0.4177 172.1561 177.8927 35.9745 5.7196 6.3066 2.4758 16.6221 27.6905 19.5630 6.8292 24.1657 57.0115 45.1809 35.3589
temp: 298.150 k
press: 1.00000 atm
elementType: 17 8 8 7 7 7 7 7 6 6 6 6 6 6 6 6 6 6 6 6 1 1 1 1 1 1 1 1 1 1 1 1
symmnumber: 1
zpe: 620467.2 jmol-1
zpe.correction: 0.236323 hartree
zpe.thermalcorrener: 0.254707 hartree
zpe.thermalcorrenthalpy: 0.255651 hartree
zpe.thermalcorrgfe: 0.185873 hartree
zpe.sumelectzpe: -1347.283980 hartree
zpe.sumelectthermal: -1347.265597 hartree
zpe.sumelectthermalent: -1347.264652 hartree
zpe.sumelectthermalfe: -1347.334431 hartree
dipole: 0.5905 -3.9816 -1.2367
dipole: 4.2109
quadrupole: -108.8394 -113.6429 -124.9818
quadrupole: 19.7469 -4.3252 2.5688
quadrupole: 6.9820 2.1785 -9.1604 19.7469 -4.3252 2.5688
hfenergy: -1347.5203037 hartree
pointgroup: C01 [X(C12H12Cl1N5O2)]
dipole: -0.0148247 1.5800293 -0.4978785 debye
polarizability: 222.8854273|0.4349921|193.4453135|44.7276012|-3.666392|118.6190766 unknown
InChI: InChI=1S/C12H12ClN5O2/c13-10-9(14)11(16-7-15-10)17-18-12(19)20-6-8-4-2-1-3-5-8/h1-5,7,17-18H,6,14H2
charge 0 multiplicity 1
32 atoms
Cl 5.257503 -2.083588 0.795392
O  -1.734386 2.139203 -0.508944
O  -0.442136 1.551428 1.384383
N  1.8113 1.686494 -0.326754
N  0.521094 2.083201 -0.69574
N  1.252386 -0.576547 -0.855294
N  4.367834 0.870687 0.577317
N  2.784192 -2.373983 -0.341524
C  -3.580438 0.584928 0.128924
C  -3.000544 1.971641 0.292678
C  -4.613333 0.346245 -0.812222
C  -3.098525 -0.492144 0.918105
C  2.141905 0.312255 -0.349033
C  3.447318 -0.070752 0.125245
C  -5.158514 -0.948019 -0.96672
C  -3.640852 -1.786251 0.762215
C  -4.672347 -2.017068 -0.178858
C  -0.549539 1.866803 0.174971
C  3.658195 -1.469224 0.118567
C  1.61396 -1.890378 -0.843015
H  -3.661121 2.747498 -0.124678
H  -2.756133 2.194131 1.345784
H  -4.989202 1.174834 -1.425369
H  -2.29364 -0.308792 1.638947
H  -5.958259 -1.122552 -1.695092
H  -3.262642 -2.612879 1.37379
H  2.205712 2.23591 0.444017
H  -5.094346 -3.021625 -0.29654
H  0.335288 2.186539 -1.693888
H  0.906439 -2.612053 -1.256094
H  5.247096 0.523602 0.961002
H  4.370936 1.805253 0.171222
