program: Gaussian 09
title: 000267742
version: EM64L-G09RevD.01
frameworkgroup: C1[X(C13H10ClN5O3)]
method: RPBEPBE
basis: SDD
operation: Freq
keyword: #p
keyword: freq=noraman
keyword: PBEPBE/SDD
title: #p freq=noraman PBEPBE/SDD
converged: YES YES NO NO
title: Mulliken charges:
elementType: Cl O O O N N N N N C C C C C C C C C C C C C H H H H H H H H H H
charge: -0.000929 -0.278341 -0.188403 -0.261657 -0.205567 -0.406820 -0.373614 0.020827 0.073065 0.181336 0.344005 0.183386 -0.300696 -0.482093 0.472991 0.366794 -0.353910 -0.386234 -0.359366 -0.224008 -0.225601 -0.230156 0.348794 0.355953 0.228414 0.249141 0.260230 0.233192 0.268531 0.228998 0.230358 0.231381
chargesum: 0.00000
title: Mulliken charges with hydrogens summed into heavy atoms:
elementType: Cl O O O N N N N N C C C C C C C C C C C C C
charge: -0.000929 -0.278341 -0.188403 -0.261657 -0.205567 -0.058026 -0.017660 0.020827 0.073065 0.181336 0.344005 0.183386 -0.300696 -0.004538 0.472991 0.366794 -0.093680 -0.153042 -0.090835 0.004989 0.004756 0.001225
polarizability: 2.38367050e+02 -9.88220594e-01 2.14390872e+02 3.75989183e+01 2.14938108e+00 1.19912270e+02
1716.lowfreq: 0.0008 0.0011 0.0013 0.5306 2.7943 5.3902 16.5892 19.4442 27.3691
frequency: 16.5464 19.0824 27.3591 43.5108 51.0519 80.0272 108.0179 141.6165 150.9115 166.6438 198.3956 213.8962 240.8729 306.5580 313.6422 323.1139 350.6577 371.8377 383.5147 404.6403 428.8613 463.6057 494.1344 524.5238 535.2942 581.0016 585.6659 605.1539 612.8964 617.4382 640.3245 656.2533 691.5526 704.3576 709.6567 732.1029 763.5926 773.2067 809.8326 816.3640 838.3898 858.4366 885.5855 908.0764 934.8746 955.8992 982.3815 988.0013 991.9682 993.8304 1002.0664 1027.4718 1092.5989 1103.8400 1144.6920 1164.0193 1174.4493 1190.7506 1198.5998 1223.9841 1238.6173 1246.3641 1300.0077 1310.3653 1331.8984 1348.9783 1369.3360 1386.4386 1395.2019 1442.9690 1455.0388 1462.6134 1465.8458 1485.5354 1536.9536 1594.8932 1606.4433 1615.2042 1669.1375 1728.0813 3041.0005 3116.8935 3121.1873 3129.7937 3141.2492 3152.2527 3166.4144 3193.5463 3564.2625 3598.4605
redmass: 7.2415 6.5128 5.4439 6.3615 6.9542 10.3530 8.1533 9.8343 6.5905 13.3947 7.7667 9.3269 8.0206 5.6310 5.4129 4.3049 4.0929 15.6051 4.6349 2.8106 5.2888 1.2457 4.6423 10.7783 6.2112 5.6342 1.1280 5.8448 6.1019 6.1969 6.2087 6.5103 9.5131 1.9348 9.2818 4.4092 2.7550 9.1550 7.8036 3.5150 8.1380 1.2503 7.7524 1.4304 1.4924 2.7040 1.5448 2.7985 4.6231 7.1721 1.3377 2.2185 1.5233 6.4721 5.6269 5.0001 1.0550 1.1668 3.7310 2.8223 1.1592 6.2729 4.5397 1.5513 1.2560 1.2389 7.1718 8.0799 1.5798 2.1832 1.6122 1.3038 5.1558 2.3003 9.6845 6.0736 10.4095 6.0518 9.8546 10.3984 1.0590 1.1064 1.0881 1.0873 1.0919 1.0965 1.1016 1.0932 1.0795 1.0812
irintensity: 0.1296 0.1918 0.1650 0.6578 0.3051 5.3406 1.3285 5.0840 0.8166 0.3778 3.7693 0.6072 8.9162 6.8583 2.9394 1.6107 10.0367 10.3695 15.6571 0.0906 0.6954 98.6262 18.2962 4.4501 10.5298 18.5643 105.4853 6.4476 9.0627 0.1975 13.5248 4.8438 19.8889 41.6047 31.1759 42.9553 84.3386 5.3701 50.3325 7.4540 51.8274 0.1601 24.4702 12.7567 9.0569 45.9091 8.3732 47.3928 22.5601 31.3321 1.3420 3.4451 7.4299 157.1394 22.5244 499.4501 0.7761 2.0769 120.1527 24.5518 9.9186 17.4559 42.4235 45.9275 1.8320 16.8456 138.1960 0.8345 28.0926 10.8481 252.0838 108.4497 54.0961 8.8724 122.7544 1.2482 63.3579 0.4954 194.7243 612.5344 29.7347 3.3375 6.7449 1.7634 15.3677 26.8010 19.7385 5.2701 54.7557 95.1219
temp: 298.150 k
press: 1.00000 atm
elementType: 17 8 8 8 7 7 7 7 7 6 6 6 6 6 6 6 6 6 6 6 6 6 1 1 1 1 1 1 1 1 1 1
symmnumber: 1
zpe: 589355.9 jmol-1
zpe.correction: 0.224474 hartree
zpe.thermalcorrener: 0.243079 hartree
zpe.thermalcorrenthalpy: 0.244024 hartree
zpe.thermalcorrgfe: 0.173733 hartree
zpe.sumelectzpe: -1459.320562 hartree
zpe.sumelectthermal: -1459.301957 hartree
zpe.sumelectthermalent: -1459.301012 hartree
zpe.sumelectthermalfe: -1459.371303 hartree
dipole: -1.8104 0.1128 -1.6442
dipole: 2.4482
quadrupole: -118.5460 -138.5366 -130.6203
quadrupole: 8.3524 3.5866 -3.4580
quadrupole: 10.6883 -9.3023 -1.3860 8.3524 3.5866 -3.4580
hfenergy: -1459.5450359 hartree
pointgroup: C01 [X(C13H10Cl1N5O3)]
dipole: 0.6672236 -0.3131213 -0.6201131 debye
polarizability: 233.1664816|-16.9413304|205.5817098|-41.2018864|-27.0651174|133.9220002 unknown
InChI: InChI=1S/C13H10ClN5O3/c14-10-9-11(16-7-15-10)19(12(20)17-9)18-13(21)22-6-8-4-2-1-3-5-8/h1-5,7,17-18H,6H2
charge 0 multiplicity 1
32 atoms
Cl -5.649724 1.828583 0.604045
O  1.902104 -1.852389 0.084147
O  -2.313011 -2.78597 1.349932
O  0.662133 -0.439717 1.521386
N  -1.544084 -1.02103 -0.108718
N  -3.552635 -0.778863 0.89139
N  -0.279011 -1.499325 -0.358886
N  -1.492263 1.13998 -1.32348
N  -3.494258 2.48969 -0.958575
C  -2.046482 0.228738 -0.503101
C  -3.324313 0.365233 0.128896
C  -2.462096 -1.678529 0.802279
C  -4.014078 1.549541 -0.147941
C  3.156995 -1.594483 0.886882
C  3.937892 -0.42263 0.338565
C  0.763984 -1.185063 0.522512
C  -2.267175 2.256836 -1.510911
C  4.978581 -0.632674 -0.601513
C  3.6419 0.899679 0.761669
C  5.712219 0.45958 -1.115426
C  4.373437 1.991911 0.246588
C  5.410037 1.774725 -0.691689
H  -4.371299 -0.963528 1.469551
H  -0.127939 -2.12929 -1.147619
H  3.704635 -2.543835 0.784203
H  2.849046 -1.434657 1.934138
H  -1.865469 3.033283 -2.16522
H  5.212834 -1.652497 -0.931285
H  2.833091 1.063353 1.482789
H  6.516215 0.287355 -1.839499
H  4.138475 3.00957 0.577303
H  5.978956 2.623222 -1.088212
