program: Gaussian 09
title: 000267736
version: EM64L-G09RevD.01
frameworkgroup: C1[X(C14H13ClN2O2)]
method: RPBEPBE
basis: SDD
operation: Freq
keyword: #p
keyword: freq=noraman
keyword: PBEPBE/SDD
title: #p freq=noraman PBEPBE/SDD
converged: YES YES NO NO
title: Mulliken charges:
elementType: Cl O O N N C C C C C C C C C C C C C C H H H H H H H H H H H H H
charge: -0.036836 -0.314832 -0.262902 -0.345315 -0.504506 -0.265275 0.373604 0.177856 -0.384041 -0.409284 0.552367 -0.228789 -0.217253 -0.239922 -0.349486 -0.320957 -0.209456 -0.243289 -0.242204 0.254080 0.266169 0.284349 0.228767 0.228486 0.229941 0.273522 0.361104 0.257212 0.234699 0.237268 0.304196 0.310728
chargesum: 0.00000
title: Mulliken charges with hydrogens summed into heavy atoms:
elementType: Cl O O N N C C C C C C C C C C C C C C
charge: -0.036836 -0.314832 -0.262902 0.015789 0.110418 -0.011195 0.373604 0.177856 -0.117872 -0.124935 0.552367 -0.000022 0.011233 -0.009981 -0.349486 -0.047435 0.047755 -0.008589 -0.004937
polarizability: 2.30322517e+02 -1.18989847e+01 1.79286954e+02 5.76256024e-01 -3.19841841e+01 1.17325248e+02
1716.lowfreq: -10.3487 -7.1298 -4.1700 -0.0013 -0.0010 0.0005 27.7695 32.6897 33.4302
frequency: 27.5546 32.6613 33.2824 48.5848 64.5319 84.4954 129.8116 135.4549 171.6720 182.7070 188.5994 204.6837 241.5143 264.7566 309.3899 325.9534 367.2224 400.8220 403.5507 442.3344 471.3163 534.1478 537.8504 566.5168 607.9166 616.3515 636.0976 665.1479 675.6592 700.5999 709.2415 720.4750 754.0703 755.7805 771.6379 810.0663 845.6568 862.8678 868.9915 922.7059 932.4595 940.5542 975.2325 987.0812 989.5984 991.4849 1002.3943 1020.8762 1029.4532 1042.5307 1086.4452 1132.7164 1139.6866 1173.6768 1175.2687 1189.9157 1201.6903 1224.2662 1234.7445 1266.6847 1271.7329 1283.8406 1290.9287 1327.8415 1378.3574 1383.8537 1427.1427 1437.0992 1456.9770 1470.9121 1482.0963 1576.3686 1593.3270 1602.7767 1610.6439 1619.1246 1675.0093 3004.1794 3125.7111 3134.0037 3142.0459 3146.3644 3155.3707 3161.7510 3165.7279 3177.1613 3179.0581 3396.7981 3517.1537 3536.7830
redmass: 6.4823 5.8515 4.5279 5.9578 6.6320 7.0053 2.2518 1.7670 8.0894 3.0999 4.9893 5.3974 4.7003 5.0577 5.4260 6.2279 7.2471 8.8160 3.1214 3.3179 3.5415 7.2803 3.9110 6.4144 7.0865 6.2324 1.5343 2.9756 5.6824 3.2720 3.5235 1.9254 1.2568 1.5520 2.2660 6.3607 1.4645 1.2454 3.1739 5.1424 1.3768 1.5234 1.3133 1.7197 3.2377 6.6828 1.3134 7.4023 2.2127 2.0618 1.6049 1.5421 4.5675 1.0527 1.0755 1.1793 2.3996 3.0195 1.6400 1.6861 1.5217 1.1671 1.4076 1.2768 8.5695 7.8881 2.2501 2.2183 1.8601 2.3140 2.2403 6.2190 6.2787 7.2975 6.4395 7.5853 1.0670 1.0842 1.0851 1.0890 1.0858 1.0942 1.0899 1.0987 1.0950 1.0966 1.1005 1.0427 1.0993 1.0793
irintensity: 0.4043 0.9890 0.1824 2.5408 1.0169 4.3030 10.9772 17.2270 0.0921 5.8367 0.4507 0.5140 8.8318 5.9430 31.8307 2.6937 2.1695 1.4822 0.2112 6.0347 8.1276 12.4059 0.6495 8.2679 7.8240 3.2036 109.1730 74.1767 19.1461 6.6716 7.7084 98.3748 149.6726 51.8736 27.1285 12.7112 3.3140 0.1184 4.7975 13.6334 4.2030 4.9238 0.1219 0.2020 0.7082 81.4996 0.9653 55.2221 11.1184 35.3609 5.3007 8.0546 3.7752 0.3555 4.8916 15.0437 5.8830 214.4054 30.9963 32.4293 25.8540 0.8341 6.5178 0.3404 10.7273 0.2864 26.8700 8.0977 133.8413 134.5407 29.0407 15.2981 2.1438 47.3004 51.5419 113.0052 22.9971 7.5813 0.1471 6.1422 2.3509 19.3733 10.1264 27.0457 7.4675 9.2117 10.8640 0.4419 2.4917 34.0501
temp: 298.150 k
press: 1.00000 atm
elementType: 17 8 8 7 7 6 6 6 6 6 6 6 6 6 6 6 6 6 6 1 1 1 1 1 1 1 1 1 1 1 1 1
symmnumber: 1
zpe: 637367.8 jmol-1
zpe.correction: 0.242761 hartree
zpe.thermalcorrener: 0.260402 hartree
zpe.thermalcorrenthalpy: 0.261346 hartree
zpe.thermalcorrgfe: 0.194720 hartree
zpe.sumelectzpe: -1259.910336 hartree
zpe.sumelectthermal: -1259.892695 hartree
zpe.sumelectthermalent: -1259.891751 hartree
zpe.sumelectthermalfe: -1259.958377 hartree
dipole: -1.1245 0.6264 -0.3128
dipole: 1.3246
quadrupole: -99.0148 -116.6941 -120.7520
quadrupole: -7.0854 3.6579 -0.1231
quadrupole: 13.1388 -4.5405 -8.5984 -7.0854 3.6579 -0.1231
hfenergy: -1260.1530969 hartree
pointgroup: C01 [X(C14H13Cl1N2O2)]
dipole: 0.4629376 -0.2176847 -0.0995307 debye
polarizability: 224.5621138|-26.7112574|151.5976796|16.9455933|39.6417267|150.7749249 unknown
InChI: InChI=1S/C14H13ClN2O2/c15-11-8-4-5-9-12(11)19-13(14(18)17-16)10-6-2-1-3-7-10/h1-9,13,17H,16H2
charge 0 multiplicity 1
32 atoms
Cl 1.827311 1.735512 2.332781
O  0.413884 0.343347 0.160527
O  -0.953062 -2.467126 -1.699922
N  -0.626748 -2.158206 0.592702
N  -0.896349 -3.50172 0.966552
C  -0.469061 -0.191173 -0.889453
C  -1.797522 0.564982 -0.818504
C  -0.689542 -1.71783 -0.711948
C  -2.817366 0.234887 -1.746944
C  -2.020816 1.58006 0.141745
C  1.791487 0.095496 0.065751
C  -4.052926 0.916263 -1.711345
C  -3.260944 2.258999 0.171195
C  -4.279285 1.931203 -0.751852
C  2.607618 0.709487 1.049661
C  2.406182 -0.71005 -0.925105
C  4.002024 0.541671 1.053018
C  3.809098 -0.878903 -0.926158
C  4.610241 -0.256954 0.05547
H  -0.007666 -0.050398 -1.886376
H  -2.645246 -0.558878 -2.48323
H  -1.226661 1.837812 0.847318
H  -4.83633 0.656023 -2.431693
H  -3.428017 3.046229 0.9149
H  -5.238158 2.460812 -0.726261
H  1.803971 -1.214682 -1.68646
H  -0.442295 -1.500777 1.354133
H  4.60228 1.031973 1.825164
H  4.270192 -1.50367 -1.698038
H  5.696545 -0.388313 0.054165
H  -0.13037 -4.1236 0.671445
H  -1.792169 -3.809177 0.562364
