program: Gaussian 09
title: 000267697
version: EM64L-G09RevD.01
frameworkgroup: C1[X(C9H10O3)]
method: RPBEPBE
basis: SDD
operation: Freq
keyword: #pfreq=noraman
keyword: PBEPBE/SDD
title: #p freq=noraman PBEPBE/SDD
converged: YES YES NO NO
title: Mulliken charges:
elementType: O O O C C C C C C C C C H H H H H H H H H H
charge: -0.277881 -0.448967 -0.240340 -0.130256 0.381269 0.174568 -0.661894 -0.397339 -0.321546 -0.194040 -0.208589 -0.243796 0.246607 0.249124 0.222235 0.224749 0.258622 0.303806 0.234555 0.232712 0.233421 0.362980
chargesum: 0.00000
title: Mulliken charges with hydrogens summed into heavy atoms:
elementType: O O O C C C C C C C C C
charge: -0.277881 -0.085987 -0.240340 0.116351 0.381269 0.174568 0.034215 -0.138716 -0.017740 0.040515 0.024123 -0.010375
polarizability: 1.53153880e+02 -2.58360656e+00 1.08032258e+02 2.23401316e+00 7.56106878e+00 5.54345853e+01
1716.lowfreq: -7.4263 0.0004 0.0007 0.0010 2.7356 5.0188 27.1808 46.8855 62.6953
frequency: 26.8813 46.8789 62.6752 115.8989 198.6885 222.3057 251.9861 292.3669 308.7689 321.7496 349.6823 409.8818 421.8820 502.9110 577.1146 604.7694 640.2669 693.1506 704.0297 764.8705 766.7653 829.9325 845.5804 905.9676 926.8575 979.3201 987.0051 997.5476 1015.1262 1023.4413 1068.2212 1080.9400 1090.4487 1141.0778 1161.3003 1171.4974 1191.5305 1238.4558 1302.7273 1313.2390 1372.3800 1380.7638 1385.8892 1443.5474 1463.3858 1470.3254 1472.9772 1591.0488 1609.0126 1620.8864 2995.3850 3037.5295 3099.6346 3110.3522 3135.4373 3146.6835 3162.4677 3175.2903 3209.3178 3489.9001
redmass: 3.6673 7.0101 5.2185 4.7563 3.1979 1.1678 4.5198 2.4991 3.9203 1.8535 5.7925 2.9304 2.6482 3.1373 7.2523 6.3306 5.9651 2.2950 3.9025 6.2045 1.5291 4.4937 1.2480 2.6027 1.3992 1.3615 6.2526 1.3064 2.0046 2.1669 2.7024 1.5457 2.1900 2.2743 2.6642 1.0684 1.4041 1.4679 1.2774 1.3202 1.3806 1.3911 4.0631 2.2658 1.0667 2.1396 1.0612 6.2915 6.5389 10.3018 1.0346 1.0852 1.1007 1.1007 1.0855 1.0904 1.0951 1.0997 1.0949 1.0651
irintensity: 1.6447 4.3215 3.8231 0.2182 3.3842 0.6662 1.5359 43.9852 36.7279 90.8700 27.0978 0.2393 0.2674 10.7522 0.5324 3.0766 7.8299 29.2049 9.2823 12.7983 94.5568 2.4190 0.0264 7.3735 11.4099 0.0791 4.6096 1.5318 55.7239 5.5033 100.6571 23.0971 179.1422 10.5384 391.9034 5.1157 127.7117 80.7476 0.5781 1.0614 33.8885 13.1271 8.5817 10.9362 19.3616 68.7441 22.8777 23.7974 9.5268 182.9720 15.0261 14.9691 29.2102 20.3739 0.0266 15.0290 22.5051 9.2915 3.8291 22.1896
temp: 298.150 k
press: 1.00000 atm
elementType: 8 8 8 6 6 6 6 6 6 6 6 6 1 1 1 1 1 1 1 1 1 1
symmnumber: 1
zpe: 448156.7 jmol-1
zpe.correction: 0.170694 hartree
zpe.thermalcorrener: 0.182290 hartree
zpe.thermalcorrenthalpy: 0.183234 hartree
zpe.thermalcorrgfe: 0.131751 hartree
zpe.sumelectzpe: -573.732165 hartree
zpe.sumelectthermal: -573.720569 hartree
zpe.sumelectthermalent: -573.719625 hartree
zpe.sumelectthermalfe: -573.771108 hartree
dipole: 2.8065 -1.5479 0.8088
dipole: 3.3055
quadrupole: -70.5673 -65.5654 -73.2028
quadrupole: 2.9284 -3.4252 1.8569
quadrupole: -0.7888 4.2131 -3.4243 2.9284 -3.4252 1.8569
hfenergy: -573.9028589 hartree
pointgroup: C01 [X(C9H10O3)]
dipole: -1.0684703 0.6673175 0.3229967 debye
dipolederiv: -2.0954868 0.3105966 0.0855598 0.5856035 -0.4966767 0.0557687 0.0583509 0.0819967 -0.1879567 -0.6740976 0.2172397 -0.0441661 0.1497562 -0.5888396 -0.2016966 -0.0620669 -0.1788507 -0.4467987 -0.7442039 -0.0626554 0.0485028 0.4875475 -0.8739919 0.0788426 -0.1067635 0.2097836 -0.3181565 0.239281 -0.2567727 0.0169895 -0.3937253 0.3989271 0.1432823 0.0031527 0.0904842 0.3473517 1.2939534 -0.05366 -0.1126022 0.1188744 0.123355 -0.0215306 -0.1993981 0.0041192 0.114364 1.8151182 -0.0835329 -0.0488166 -0.9958309 1.128888 -0.1747005 0.145287 -0.3406188 0.2176345 -0.0856796 -0.0546536 -0.0282614 0.0536954 -0.0325062 -0.0905758 0.1202915 -0.0764347 -0.0358576 -0.2752665 0.0524483 -0.0123401 0.08033 -0.0180776 -0.0600987 -0.0128411 -0.054765 -0.1487917 -0.2674477 -0.0349164 0.0181142 -0.1012385 -0.1126126 0.0024801 0.0456297 -0.0060156 -0.1483581 0.0722269 -0.0669374 -0.0088841 -0.0873022 0.0796547 -0.0579826 -0.0049098 -0.0609659 -0.127537 -0.0042233 0.0373452 -0.0325225 0.0661099 0.1131635 -0.0879059 -0.0404714 -0.0865447 -0.1162823 0.0462414 0.0259763 -0.0407315 -0.0030538 -0.112442 -0.0167096 -0.027035 -0.0196474 -0.1545719 0.0211602 0.0441762 -0.0263325 0.0480044 0.0114736 0.0436244 -0.0536417 0.0569243 -0.073741 -0.1005487 -0.1010329 0.0331695 -0.1166912 0.0578232 0.0022967 0.0179466 -0.000895 0.0778357 0.1154344 -0.0167005 -0.006045 0.0142024 0.0242935 0.106494 -0.0303461 0.04707 -0.0954124 0.0192819 0.1334459 0.0022925 0.1244496 -0.0370033 -0.0311246 0.0023846 -0.0072142 0.0842211 0.0846083 -0.0654173 0.0342436 -0.0613447 0.0057907 0.0596366 0.0339055 0.0595851 0.1512267 0.1385682 0.0565299 -0.0071612 0.0524093 0.0781878 0.027882 -0.0065586 0.0267044 0.1767708 0.0010145 0.0947305 -0.0091871 0.1039284 -0.0287456 0.0445671 -0.0101852 0.0449887 0.1472045 0.0401337 -0.0526687 0.0309868 -0.0729875 -0.0514069 0.0733636 0.038426 0.0716166 0.1301837 -0.1165571 -0.0150467 0.0427359 -0.0157186 0.0979486 0.0237929 0.044206 0.0237825 0.1545748 0.4764889 -0.1084941 0.0644556 -0.0370183 0.2327968 0.0802939 0.0446369 0.1148967 0.2520965 unknown
polarizability: 152.2183657|-4.8684082|105.8538204|-8.8266672|-12.8671651|58.5485368 unknown
InChI: InChI=1S/C9H10O3/c1-7(10)9(11)12-8-5-3-2-4-6-8/h2-7,10H,1H3
charge 0 multiplicity 1
22 atoms
O  0.527307 0.507353 -0.473635
O  3.941365 -0.731139 -0.825246
O  1.4948 -1.568876 0.090105
C  2.911294 0.289155 -0.666624
C  -0.854039 0.23216 -0.190716
C  1.579854 -0.384664 -0.312066
C  3.306656 1.322972 0.414537
C  -1.694667 1.343288 -0.418713
C  -1.363238 -1.006749 0.261281
C  -3.080186 1.216883 -0.188748
C  -2.756453 -1.11059 0.485185
C  -3.61658 -0.011863 0.264653
H  2.80174 0.79574 -1.642078
H  4.299905 1.728511 0.160721
H  3.370539 0.846456 1.408774
H  2.577863 2.151141 0.457237
H  -1.254696 2.281066 -0.77073
H  -0.700035 -1.855163 0.431644
H  -3.737165 2.0753 -0.363955
H  -3.16517 -2.064732 0.835175
H  -4.692503 -0.110233 0.4429
H  3.646208 -1.546118 -0.334704
