program: Gaussian 09
title: 000267696
version: EM64L-G09RevD.01
frameworkgroup: C1[X(C5H9N5S)]
method: RPBEPBE
basis: SDD
operation: Freq
keyword: #pfreq=noraman
keyword: PBEPBE/SDD
title: #p freq=noraman PBEPBE/SDD
converged: YES YES NO NO
title: Mulliken charges:
elementType: S N N N N N C C C C C H H H H H H H H H
charge: 0.173621 -0.069574 -0.110118 -0.670382 -0.622098 -0.593236 0.153745 -0.298634 0.190736 -0.039894 -0.820668 0.301314 0.300543 0.318701 0.344550 0.236621 0.277624 0.278066 0.322804 0.326280
chargesum: 0.00000
title: Mulliken charges with hydrogens summed into heavy atoms:
elementType: S N N N N N C C C C C
charge: 0.173621 -0.069574 -0.110118 -0.068526 0.041153 0.055848 0.153745 -0.298634 0.190736 -0.039894 -0.028357
polarizability: 1.49561508e+02 -4.75664947e+00 1.34231828e+02 7.42663841e-02 -1.26595043e-01 5.11885740e+01
1716.lowfreq: -11.9462 -8.2235 -6.8280 0.0009 0.0023 0.0028 51.5882 88.0134 110.1380
frequency: 51.5187 88.0005 110.1279 122.5854 151.7922 171.8101 222.7256 247.3756 289.2098 313.4127 319.0980 395.4179 428.2945 479.3456 487.9707 521.2087 545.2997 585.9739 601.8735 645.2107 648.1773 662.6741 701.5786 762.1857 771.7940 857.9139 959.8076 976.1311 990.6150 1005.2317 1126.2299 1151.9616 1232.0219 1299.6407 1325.6086 1344.3476 1432.7018 1445.1150 1452.4097 1475.3515 1504.7567 1553.2591 1584.5570 1608.7786 1640.0980 3024.2119 3148.9397 3156.4320 3440.3487 3520.2910 3549.2999 3567.8698 3693.7810 3728.0988
redmass: 2.6404 1.1030 2.8355 1.4059 3.6768 5.8678 6.0437 4.3585 2.9212 3.8611 3.3344 8.0108 1.2041 1.1839 5.9731 1.0637 3.0074 5.9230 5.9305 1.5147 1.1048 6.1805 9.6908 7.1385 9.7718 5.2941 2.8953 1.1772 1.5751 1.8200 2.1657 1.2790 5.0456 6.2852 3.0165 1.4666 1.0537 2.8504 1.3067 2.9277 2.3905 4.1602 1.9803 1.6523 1.1819 1.0280 1.1040 1.1057 1.0441 1.0446 1.0980 1.0439 1.1040 1.1059
irintensity: 0.7225 0.0053 9.4374 2.9329 1.3470 9.4967 5.4506 1.1564 11.6519 7.2404 11.6101 2.8027 232.9060 307.2209 0.9860 16.6990 16.7442 10.4638 1.6037 226.0021 76.5480 19.2320 1.1203 2.9313 34.7013 82.3248 19.9399 6.9213 24.2222 0.0944 1.8877 1.3404 2.1174 99.3662 1.8741 10.3122 13.2975 236.7187 38.6181 104.2690 161.7190 129.2101 707.1387 262.7867 147.5384 26.1004 10.0694 12.3287 1.1515 87.7635 8.5799 95.0413 62.0710 42.0235
temp: 298.150 k
press: 1.00000 atm
elementType: 16 7 7 7 7 7 6 6 6 6 6 1 1 1 1 1 1 1 1 1
symmnumber: 1
zpe: 401469.6 jmol-1
zpe.correction: 0.152912 hartree
zpe.thermalcorrener: 0.165077 hartree
zpe.thermalcorrenthalpy: 0.166021 hartree
zpe.thermalcorrgfe: 0.114758 hartree
zpe.sumelectzpe: -866.945493 hartree
zpe.sumelectthermal: -866.933328 hartree
zpe.sumelectthermalent: -866.932384 hartree
zpe.sumelectthermalfe: -866.983647 hartree
dipole: 0.3880 0.0417 0.0173
dipole: 0.3906
quadrupole: -63.7967 -56.3042 -74.7336
quadrupole: -3.1956 0.0211 -0.1565
quadrupole: 1.1481 8.6407 -9.7888 -3.1956 0.0211 -0.1565
hfenergy: -867.098405 hartree
pointgroup: C01 [X(C5H9N5S1)]
dipole: -0.1461581 0.0466413 -0.0091438 debye
dipolederiv: -0.6325088 0.1983712 -0.0079456 0.4180363 -0.1072296 0.0065663 -0.0094565 0.0030947 -0.1397047 -0.8105232 0.5136159 -0.0120371 0.321736 -1.4550176 0.0181843 -0.0170647 0.0164564 -0.2091688 -0.7861157 -0.3991731 -0.0006567 -0.2314889 -1.1417432 0.0100175 -0.0032258 0.0068242 -0.2892378 -0.7082358 -0.2360021 0.0250185 -0.1134777 -0.6076541 0.0144373 0.0222134 0.014668 -0.1359374 -1.3903699 -0.4883752 -0.0046687 -0.4711299 -0.4604875 -0.0126612 -0.0245696 -0.0175845 -0.7024776 -0.1964873 -0.0169402 0.0074541 0.0302124 -1.633113 0.0106084 0.006277 0.0096868 -0.7377604 -1.080627 -0.1737353 -0.0187716 0.2558493 0.2484091 -0.0045568 -0.0171363 0.0045645 -0.0833032 1.4086751 -0.2528512 0.0205007 -0.4238518 0.8930306 -0.0129282 0.0259747 -0.022201 -0.0132275 1.7476123 0.4970603 0.0088218 0.1888169 0.8994101 -0.0068384 0.0139094 0.0076811 0.195702 0.8306974 -0.079736 0.0070826 -0.0408399 2.146258 -0.0259088 0.0104942 -0.0276545 0.2064861 0.1779268 0.0687378 0.0024501 0.0588016 0.028875 0.0017013 0.0023795 0.0040368 0.0585518 0.2972638 0.1683262 0.1093249 0.0427847 0.1156272 -0.0053246 0.0611194 -0.0135891 0.113439 0.2775108 0.1441343 -0.1317755 0.0425824 0.123291 -0.002481 -0.0818804 -0.0038589 0.1370296 0.2560622 0.0336259 0.0014137 0.0057496 0.1536714 0.0033851 0.0100515 0.0048151 0.383604 0.273121 0.0107536 0.0006737 0.0336429 0.2467386 0.0042487 0.0078639 0.0082456 0.3647306 -0.1200751 0.0589053 -0.0038334 0.089611 0.0527846 0.0012905 -0.0043452 0.0009248 0.1242102 0.0696135 -0.0186113 0.0275782 -0.1000529 -0.0049288 -0.0982473 0.0154113 -0.07092 -0.0237352 0.0721511 -0.0215466 -0.0248711 -0.1037341 -0.0047058 0.0945747 -0.0121754 0.0696576 -0.0248746 0.151539 0.0442887 -0.0032722 0.0131951 0.2580854 0.0020891 -0.0031008 0.0031633 0.3842712 0.1627698 -0.0508482 -0.0024864 -0.0164428 0.2486986 0.001843 -0.0027395 0.0019893 0.3914027 unknown
polarizability: 150.7978527|1.3691157|132.9701432|1.2985389|-0.8231679|51.2139141 unknown
InChI: InChI=1S/C5H9N5S/c1-11-4-2(6)3(7)9-5(8)10-4/h6-8H2,1H3
charge 0 multiplicity 1
20 atoms
S  2.303625 -1.343317 0.053892
N  0.821645 0.988365 0.014262
N  -1.629462 1.075696 -0.017393
N  -0.577408 -2.527217 0.040143
N  -2.878173 -0.92187 -0.00073
N  -0.335442 3.023958 -0.026968
C  -0.464252 -1.091401 0.019059
C  0.749497 -0.368887 0.025706
C  -1.658922 -0.294209 0.000397
C  -0.386817 1.646897 -0.009648
C  3.565142 0.051742 0.07125
H  -0.288586 -3.0003 -0.823293
H  -0.186751 -2.980382 0.873404
H  -3.731223 -0.369948 -0.002553
H  -2.875668 -1.941309 0.034995
H  4.549099 -0.442716 0.087087
H  3.417685 0.67131 0.966398
H  3.444838 0.668344 -0.829938
H  0.56899 3.485464 -0.022873
H  -1.204116 3.549779 -0.046198
