program: Gaussian 09
title: 000267689
version: EM64L-G09RevD.01
frameworkgroup: C1[X(C11H16O)]
method: RPBEPBE
basis: SDD
operation: Freq
keyword: #pfreq=noraman
keyword: PBEPBE/SDD
title: #p freq=noraman PBEPBE/SDD
converged: YES YES NO NO
title: Mulliken charges:
elementType: O C C C C C C C C C C C H H H H H H H H H H H H H H H H
charge: -0.185463 0.426124 -0.224667 -0.153447 -0.382060 -0.473308 -0.534293 -0.470161 -0.439658 0.111462 -0.530206 -0.817682 0.238831 0.250947 0.286958 0.223866 0.208304 0.222970 0.219129 0.205375 0.229240 0.204525 0.227787 0.234011 0.258843 0.216897 0.221832 0.223846
chargesum: 0.00000
title: Mulliken charges with hydrogens summed into heavy atoms:
elementType: O C C C C C C C C C C C
charge: -0.185463 0.426124 0.014163 0.097500 -0.095102 -0.041137 -0.092194 -0.035545 -0.007346 0.111462 -0.037352 -0.155108
polarizability: 1.25532076e+02 1.26139760e+00 1.10687447e+02 -3.65149145e-01 -2.49341143e+00 9.48974055e+01
1716.lowfreq: -18.2806 -11.9445 -3.9641 -0.0009 -0.0008 -0.0007 71.2602 95.1233 147.1461
frequency: 70.7781 95.0713 147.1316 188.8276 215.4839 253.3694 280.9439 318.2757 340.3771 375.4432 438.2502 496.5560 537.0493 564.8331 599.7415 637.0100 676.9360 778.0862 786.7934 830.6270 837.6753 840.0570 870.3777 880.0659 898.9900 912.0237 933.8558 951.2859 980.4574 1009.1314 1044.1176 1046.6958 1048.5381 1091.1660 1096.1301 1102.8835 1144.0295 1147.9465 1153.8113 1167.8768 1185.2619 1207.5975 1222.6483 1236.5434 1244.9658 1249.4092 1267.6238 1270.6616 1289.9580 1297.3986 1311.1432 1318.1631 1329.8245 1390.1802 1436.9675 1460.4345 1463.6427 1469.7083 1470.8619 1482.7327 1489.4883 1650.5823 2968.1169 2981.3381 2986.4909 2987.9733 2990.5093 2995.7791 3013.8023 3037.3188 3049.4480 3051.0103 3052.5214 3055.0087 3057.3710 3069.0015 3073.6396 3082.5976
redmass: 3.2104 3.8424 2.8026 2.4266 1.2124 2.2899 2.2429 2.1774 2.5578 2.3143 3.5020 3.1068 2.4689 2.6116 2.5646 5.0565 2.4306 2.6819 3.2942 2.5267 2.0675 1.8815 2.0841 2.5511 1.8991 1.9423 1.9540 2.1199 1.6136 1.9270 1.7498 1.6696 1.5576 1.2596 1.8909 1.4490 1.6728 1.9198 2.2520 1.9126 1.9676 1.6651 1.5862 1.8401 1.4970 1.4746 1.5514 1.4729 1.3758 1.4189 1.3904 1.5038 1.6509 1.2139 1.0793 1.0804 1.0721 1.0850 1.0672 1.0856 1.0655 11.4159 1.0369 1.0661 1.0639 1.0631 1.0617 1.0638 1.0849 1.0898 1.1000 1.0998 1.0981 1.0973 1.0909 1.1031 1.0985 1.0960
irintensity: 1.0964 4.0715 0.1775 0.0745 0.2197 0.1722 0.2206 0.1521 0.8419 0.2656 6.1588 3.3229 3.5118 3.2654 0.7523 1.4756 0.4770 5.1538 2.0706 1.8123 3.5758 1.8062 1.2567 0.8869 4.2743 2.6899 9.2284 3.4061 0.7285 9.4317 18.0057 4.1680 0.9687 0.5178 7.0350 12.8077 8.1456 6.7709 12.1408 25.5649 23.5774 10.6714 2.8566 0.7078 7.3734 7.8602 0.8149 5.8626 5.7746 1.1951 1.1777 2.8142 2.7708 15.8497 20.4440 16.5283 4.0754 10.1686 4.4558 18.6890 2.6380 231.7705 28.1394 16.3348 22.0225 32.0413 38.4729 31.3584 46.9820 37.6506 4.0932 33.0198 12.6069 27.5915 34.4838 95.8892 19.6061 26.1119
temp: 298.150 k
press: 1.00000 atm
elementType: 8 6 6 6 6 6 6 6 6 6 6 6 1 1 1 1 1 1 1 1 1 1 1 1 1 1 1 1
symmnumber: 1
zpe: 639920.9 jmol-1
zpe.correction: 0.243733 hartree
zpe.thermalcorrener: 0.254432 hartree
zpe.thermalcorrenthalpy: 0.255376 hartree
zpe.thermalcorrgfe: 0.207894 hartree
zpe.sumelectzpe: -503.047364 hartree
zpe.sumelectthermal: -503.036665 hartree
zpe.sumelectthermalent: -503.035721 hartree
zpe.sumelectthermalfe: -503.083203 hartree
dipole: 2.5394 2.3959 -1.3677
dipole: 3.7496
quadrupole: -79.0536 -77.0935 -71.4847
quadrupole: -8.7243 3.6019 2.6452
quadrupole: -3.1763 -1.2162 4.3926 -8.7243 3.6019 2.6452
hfenergy: -503.2910974 hartree
pointgroup: C01 [X(C11H16O1)]
dipole: -0.9964981 0.9371717 0.5521749 debye
polarizability: 125.5285158|-1.226249|110.6432908|-0.5747201|2.6290225|94.9451227 unknown
InChI: InChI=1S/C11H16O/c1-11-6-5-9(12)10(11)7-3-2-4-8(7)11/h7-8,10H,2-6H2,1H3
charge 0 multiplicity 1
28 atoms
O  2.635431 -1.631613 -0.775243
C  0.154703 1.053303 -0.216455
C  -0.902948 0.522802 0.840514
C  -0.517564 -0.969535 0.481081
C  0.464345 -0.435693 -0.648743
C  -2.408164 0.653992 0.494006
C  1.47937 1.572652 0.447168
C  -1.804584 -1.659289 -0.022044
C  -2.70694 -0.494472 -0.51162
C  1.920716 -0.710709 -0.307682
C  2.369404 0.335549 0.729843
C  -0.340543 2.029081 -1.291332
H  -0.689942 0.853806 1.873386
H  -0.006724 -1.552315 1.267609
H  0.195642 -0.754338 -1.669487
H  -2.67391 1.651059 0.097725
H  -3.004281 0.499359 1.414653
H  1.268547 2.1669 1.354996
H  2.001396 2.237737 -0.267074
H  -2.294471 -2.180764 0.82379
H  -1.602984 -2.412469 -0.805385
H  -2.417551 -0.196194 -1.537712
H  -3.776703 -0.767997 -0.539598
H  2.176627 -0.084021 1.738784
H  3.453314 0.523696 0.658892
H  -0.541665 3.027168 -0.85595
H  0.425325 2.157157 -2.079871
H  -1.268145 1.684147 -1.780752
