program: Gaussian 09
title: 000267695
version: EM64L-G09RevD.01
frameworkgroup: C1[X(C13H15N3O2)]
method: RPBEPBE
basis: SDD
operation: Freq
keyword: #p
keyword: freq=noraman
keyword: PBEPBE/SDD
title: #p freq=noraman PBEPBE/SDD
converged: YES YES NO NO
title: Mulliken charges:
elementType: O O N N N C C C C C C C C C C C C C H H H H H H H H H H H H H H H
charge: -0.347230 -0.280053 -0.208966 -0.645596 -0.314565 -0.346173 0.393630 0.384616 -0.167170 -0.401487 0.138103 -0.403363 -0.426163 0.311061 -0.248402 -0.235525 -0.248155 -0.666126 0.275853 0.270695 0.230431 0.230335 0.230555 0.224523 0.224541 0.301832 0.356415 0.203931 0.222940 0.244119 0.223664 0.261259 0.210472
chargesum: 0.00000
title: Mulliken charges with hydrogens summed into heavy atoms:
elementType: O O N N N C C C C C C C C C C C C C
charge: -0.347230 -0.280053 -0.208966 0.012652 -0.110635 -0.070320 0.393630 0.384616 0.103525 -0.171056 0.138103 -0.173028 -0.195608 0.311061 -0.023879 -0.010985 0.218904 0.029269
polarizability: 2.54964687e+02 2.79340144e+00 1.42757482e+02 -4.85824202e+00 -1.97936800e+01 1.23616143e+02
1716.lowfreq: -10.8900 -4.8552 -0.0003 0.0008 0.0010 3.5578 41.2437 44.1566 55.8947
frequency: 41.1989 43.9302 55.8892 74.5597 90.0002 104.3484 134.4102 142.0435 186.5804 219.9621 248.7194 277.4871 309.7523 334.6738 343.2595 359.2956 405.3071 418.6699 444.8346 478.7029 493.5816 516.1609 541.0218 567.9155 577.5205 588.1796 639.4784 666.8656 685.2073 720.5051 743.0377 752.3019 788.0696 790.2046 802.9223 824.6314 835.1239 861.9943 883.9498 896.8895 924.7789 935.5119 947.5782 982.4462 989.9183 1034.0532 1038.9483 1057.0158 1076.1289 1095.0876 1104.0189 1126.9657 1153.2869 1173.4164 1210.2370 1223.8908 1237.3405 1255.9061 1277.0721 1280.0143 1295.6598 1343.4970 1356.5080 1361.5467 1384.0928 1389.7979 1412.1691 1447.4942 1455.2323 1463.3994 1483.1287 1494.2603 1582.7455 1614.0100 1620.4451 1638.9195 1641.4756 1649.3667 2989.5005 3033.8753 3047.3352 3080.3479 3095.8244 3116.8721 3119.6007 3123.0760 3139.7049 3157.7325 3160.7522 3196.7887 3310.7931 3461.7155 3637.7677
redmass: 3.6965 3.2062 4.9272 4.9562 4.9755 6.5026 3.0172 5.0925 3.0355 1.3285 4.5882 4.7876 3.0067 5.9244 4.3106 4.6452 3.7949 2.9633 1.2609 3.1907 3.9297 5.9184 3.7677 3.2989 1.6781 1.8053 5.5791 4.7283 5.6846 3.2786 2.9256 1.4289 3.6161 1.6282 1.3717 1.5327 3.2513 2.0036 2.8361 2.8759 4.3963 1.3063 1.4317 1.3356 2.8965 2.6611 3.7773 1.5569 1.6418 2.1515 2.0870 1.6000 1.6537 1.0609 1.7918 1.9229 2.1075 1.5483 2.6486 1.1888 1.6021 1.4075 2.4455 1.4879 5.0845 1.2567 2.0734 2.4273 1.0976 1.0472 1.0522 2.9953 6.8668 2.7523 1.8566 7.8664 3.8815 6.6959 1.0363 1.0592 1.0841 1.0982 1.1021 1.0865 1.1066 1.0889 1.0938 1.0893 1.0999 1.0982 1.0761 1.0494 1.1007
irintensity: 0.6989 0.2027 2.8615 1.1381 0.6474 1.2620 1.5742 9.2000 3.0452 2.8012 1.1299 1.7157 7.0176 3.5381 11.2644 7.0464 2.3956 12.0662 108.9606 12.1051 8.0988 4.9948 10.2623 25.3674 69.2217 55.0696 8.0771 10.2948 27.4659 12.2203 19.2146 25.1500 7.4583 74.6987 2.6222 36.4004 5.8216 6.5961 66.2442 25.6157 22.7379 3.5979 2.0123 0.3514 9.8059 73.2293 240.3832 72.1377 8.6204 33.9404 17.4836 17.1538 34.6115 0.1492 13.2744 47.7341 112.9210 144.2482 165.4494 7.3527 20.7072 36.7274 58.4218 68.8846 36.7211 28.0991 45.0037 26.4191 39.3818 17.7112 18.5890 7.0032 3.4907 84.8036 43.8511 170.5136 419.0492 93.2248 20.5208 30.8237 2.7211 39.9998 6.8197 6.9307 25.9750 2.7357 31.2323 19.7734 30.0715 6.6604 35.1965 100.0507 44.7677
temp: 298.150 k
press: 1.00000 atm
elementType: 8 8 7 7 7 6 6 6 6 6 6 6 6 6 6 6 6 6 1 1 1 1 1 1 1 1 1 1 1 1 1 1 1
symmnumber: 1
zpe: 689756.2 jmol-1
zpe.correction: 0.262714 hartree
zpe.thermalcorrener: 0.279355 hartree
zpe.thermalcorrenthalpy: 0.280299 hartree
zpe.thermalcorrgfe: 0.218015 hartree
zpe.sumelectzpe: -817.774184 hartree
zpe.sumelectthermal: -817.757544 hartree
zpe.sumelectthermalent: -817.756599 hartree
zpe.sumelectthermalfe: -817.818883 hartree
dipole: -2.9514 2.5506 -0.9172
dipole: 4.0072
quadrupole: -91.7330 -103.4406 -101.3922
quadrupole: -13.5024 -0.1553 -1.4542
quadrupole: 7.1222 -4.5853 -2.5369 -13.5024 -0.1553 -1.4542
hfenergy: -818.0368986 hartree
pointgroup: C01 [X(C13H15N3O2)]
dipole: -1.1136674 -1.0937518 0.2213792 debye
polarizability: 255.2520259|0.0980204|148.6194641|0.8573992|-15.3744301|117.4668218 unknown
InChI: InChI=1S/C13H15N3O2/c1-2-18-13(17)16-8-7-9-5-3-4-6-10(9)11(16)12(14)15/h3-8,11,14H,2,15H2,1H3
charge 0 multiplicity 1
33 atoms
O  -2.550713 -0.543469 0.899996
O  -2.780874 1.720088 0.294416
N  -0.756128 0.572368 -0.0550
N  -1.385775 -2.14816 -1.266679
N  0.893595 -1.71361 -2.004224
C  0.053611 -0.68491 0.087806
C  1.515345 -0.359713 0.361013
C  2.079795 0.836395 -0.168513
C  -0.164447 1.694881 -0.69765
C  1.191253 1.810567 -0.803669
C  -0.115794 -1.574108 -1.179263
C  2.32706 -1.268762 1.066275
C  3.468853 1.078034 -0.004774
C  -2.076399 0.681878 0.368586
C  3.709478 -1.019482 1.23038
C  4.281314 0.154331 0.68474
C  -3.927894 -0.48305 1.482143
C  -4.993087 -0.70148 0.404875
H  -0.374177 -1.240082 0.939918
H  -0.873984 2.446801 -1.047519
H  1.613639 2.681206 -1.313747
H  1.888067 -2.190526 1.46761
H  3.904979 1.997954 -0.412801
H  4.335882 -1.737305 1.771233
H  5.353497 0.34786 0.802389
H  -1.651643 -2.690838 -2.086449
H  -2.094037 -1.921975 -0.563639
H  0.682751 -2.334201 -2.814534
H  -3.923452 -1.286035 2.236866
H  -4.051699 0.498658 1.970344
H  -5.995917 -0.707441 0.871113
H  -4.964658 0.112855 -0.337775
H  -4.853246 -1.668827 -0.110364
