program: Gaussian 09
title: 000267741
version: EM64L-G09RevD.01
frameworkgroup: C1[X(C21H23N5O2)]
method: RPBEPBE
basis: SDD
operation: Freq
keyword: #p
keyword: freq=noraman
keyword: PBEPBE/SDD
title: #p freq=noraman PBEPBE/SDD
converged: YES YES NO NO
title: Mulliken charges:
elementType: O O N N N N N C C C C C C C C C C C C C C C C C C C C C H H H H H H H H H H H H H H H H H H H H H H H
charge: -0.330229 -0.224090 -0.450393 -0.040153 -0.716544 -0.447068 -0.645756 -0.322244 0.402622 0.433041 0.436526 -0.374833 -0.398209 -0.419850 -0.399580 -0.094436 -0.522681 0.106623 -0.229993 -0.236784 -0.232445 -0.233274 0.227617 -0.240439 -0.244739 0.255746 -0.253058 -0.663346 0.223329 0.339095 0.256387 0.267016 0.240598 0.237067 0.239671 0.227111 0.226151 0.227711 0.224853 0.229987 0.227908 0.298564 0.296133 0.335141 0.296051 0.331213 0.216820 0.234036 0.210370 0.221919 0.250837
chargesum: 0.00000
title: Mulliken charges with hydrogens summed into heavy atoms:
elementType: O O N N N N N C C C C C C C C C C C C C C C C C C C C C
charge: -0.330229 -0.224090 -0.111298 -0.040153 -0.121847 -0.111926 -0.018492 -0.098915 0.402622 0.433041 0.436526 -0.118446 -0.131194 -0.179251 -0.162513 -0.094436 -0.283009 0.106623 -0.002882 -0.010633 -0.004734 -0.008421 0.227617 -0.010452 -0.016830 0.255746 0.197798 0.019781
polarizability: 3.56403133e+02 1.12046468e+01 2.84860326e+02 7.57451680e+00 -2.63300421e+00 2.09073012e+02
1716.lowfreq: -4.2214 -2.5124 -0.0006 -0.0002 0.0006 4.8715 14.6261 24.6891 26.8085
frequency: 14.4627 24.5703 26.7570 29.3717 37.5900 42.4422 44.8516 58.7541 64.8863 88.8305 91.6258 121.4436 130.4715 167.5465 199.9679 203.4522 209.2503 224.8272 230.7327 235.5800 259.0449 274.0611 287.2464 295.0679 301.9542 324.6990 335.3649 386.7099 402.8355 404.7170 418.8162 431.1837 452.4523 470.0426 499.2292 526.9526 538.3546 548.5813 588.4897 602.0514 613.0655 616.4128 619.7811 641.9888 647.7290 662.2787 667.4719 675.5270 703.3187 704.6804 708.2601 719.3797 732.2614 748.6681 773.2381 776.5942 795.7837 803.6431 833.1248 857.4389 861.0806 861.9392 866.0954 909.2848 929.0185 936.6791 969.1136 980.9554 983.6259 990.7206 991.1696 998.1190 1000.2086 1022.6450 1026.7089 1031.8695 1039.2330 1080.1897 1081.0009 1084.0280 1095.0088 1115.6862 1141.2023 1151.4849 1159.1374 1171.0497 1172.3354 1181.6457 1187.5238 1191.1436 1210.8558 1214.8389 1233.0163 1262.1929 1282.9796 1298.1719 1324.7468 1340.2295 1348.9750 1357.2657 1382.1876 1388.2540 1388.5956 1394.1973 1409.6773 1437.4129 1441.2230 1444.9013 1456.5866 1461.2824 1480.5096 1481.5526 1484.3390 1492.0720 1529.7997 1576.9945 1585.2218 1592.5936 1595.8887 1600.9569 1610.7899 1614.0472 1624.4014 1700.4416 2920.5074 2988.9641 3022.7897 3083.9779 3086.0904 3112.2762 3112.6001 3117.7836 3125.3829 3126.3301 3137.8936 3138.5387 3149.0457 3149.8324 3150.9938 3163.3222 3164.0441 3466.1867 3473.1563 3553.6820 3554.6678 3586.8146 3713.0128
redmass: 5.2928 4.4950 3.8812 5.4887 4.2302 4.8880 4.2590 5.0252 4.3952 4.2607 3.9934 4.9127 4.6301 3.0657 1.5788 1.4231 3.3998 4.6602 4.1307 3.4383 3.3431 4.9265 4.5603 4.1126 3.7407 3.6657 4.9756 1.1553 2.8165 2.8399 3.3244 1.1454 4.5215 3.7525 4.6306 1.0830 6.5185 4.3887 4.4737 2.1152 5.0161 6.1497 5.1026 4.9862 1.4550 4.4142 5.3232 1.6702 4.3810 2.1132 1.9178 3.1994 3.0407 1.9502 2.0139 4.2308 2.2880 1.1973 3.7338 1.2472 3.0634 1.3612 3.7531 2.9782 1.4794 1.5694 2.7401 1.3958 1.4347 5.1365 5.9866 1.3201 1.3218 2.5922 2.1754 3.6687 3.7374 2.5147 1.7608 1.9544 2.1568 1.3304 2.9295 2.0194 1.9001 1.0621 1.0561 1.1673 1.1826 2.0670 2.3329 2.6554 2.1337 1.6762 1.1078 1.3663 1.4417 1.4752 1.9093 1.3467 6.9860 1.3000 5.1922 3.7778 2.2189 2.1800 2.2320 3.8867 1.0855 1.0496 2.2715 2.2787 1.0605 3.2203 2.9875 1.9606 6.8194 6.1427 5.7389 1.8739 6.0292 6.0221 1.2249 9.0278 1.0824 1.0360 1.0593 1.0984 1.1027 1.0873 1.1051 1.0870 1.0861 1.0865 1.0917 1.0915 1.0958 1.0949 1.0921 1.1011 1.1014 1.0614 1.0570 1.0757 1.0439 1.1012 1.1049
irintensity: 0.0111 0.1818 0.3527 0.3285 1.1381 0.2433 2.4689 0.1262 1.4939 0.6104 1.3489 1.2080 0.7523 4.2356 18.1957 47.8274 1.9305 1.9998 0.4117 2.8018 4.7662 4.2962 4.8544 3.7034 7.4810 0.2480 10.0535 198.9564 0.2157 0.3156 5.2782 204.7288 5.8356 2.5804 12.0780 23.6781 0.7638 23.5167 15.4136 5.7397 1.6559 0.7071 9.2828 6.5915 82.4771 3.2374 5.8611 32.9907 37.9134 28.1545 51.0736 50.1576 0.9537 62.8981 26.8790 6.0293 81.2644 1.4561 8.3134 0.2259 0.9972 0.0765 2.4963 83.6487 15.7863 2.0901 35.2590 0.1073 0.1248 0.3848 0.9085 0.2901 0.7250 10.0305 13.8515 241.4625 12.1471 131.6876 36.3477 168.2111 14.2809 1.2537 152.8464 72.6520 18.1778 3.1803 0.1008 17.4515 4.8836 4.6975 49.8809 45.3041 21.2652 9.1127 3.3820 15.8855 5.7430 9.1547 50.4454 15.7120 0.4007 50.8811 7.2742 148.7623 130.9522 21.4548 29.4067 91.5516 26.8896 6.4844 10.9436 18.1066 11.7068 739.6109 109.8239 163.9768 545.5805 7.6304 10.4562 538.2837 9.1512 3.3632 171.2116 316.3504 22.8293 25.3536 44.7322 40.0174 8.4166 7.7019 36.2565 6.4130 0.1561 0.0518 18.6479 16.6808 29.7938 30.6950 6.1031 30.9566 23.6881 39.3714 25.4409 32.1305 70.9938 7.9979 36.3186
temp: 298.150 k
press: 1.00000 atm
elementType: 8 8 7 7 7 7 7 6 6 6 6 6 6 6 6 6 6 6 6 6 6 6 6 6 6 6 6 6 1 1 1 1 1 1 1 1 1 1 1 1 1 1 1 1 1 1 1 1 1 1 1
symmnumber: 1
zpe: 1072158.5 jmol-1
zpe.correction: 0.408364 hartree
zpe.thermalcorrener: 0.435229 hartree
zpe.thermalcorrenthalpy: 0.436173 hartree
zpe.thermalcorrgfe: 0.347589 hartree
zpe.sumelectzpe: -1236.259911 hartree
zpe.sumelectthermal: -1236.233046 hartree
zpe.sumelectthermalent: -1236.232102 hartree
zpe.sumelectthermalfe: -1236.320686 hartree
dipole: -4.0934 -0.4641 0.5495
dipole: 4.1562
quadrupole: -162.0463 -138.8102 -152.9629
quadrupole: 14.7327 -1.2471 -7.0649
quadrupole: -10.7731 12.4629 -1.6898 14.7327 -1.2471 -7.0649
hfenergy: -1236.6682746 hartree
pointgroup: C01 [X(C21H23N5O2)]
dipole: 1.6006813 -0.2483948 -0.2233047 debye
polarizability: 355.64977|-13.4722145|285.8323934|6.692571|-0.3186902|208.854307 unknown
InChI: InChI=1S/C21H23N5O2/c1-2-28-21(27)26-17-13-16(18(22)20(23)25-17)24-19(14-9-5-3-6-10-14)15-11-7-4-8-12-15/h3-13,19,24,26H,2,22-23H2,1H3
charge 0 multiplicity 1
51 atoms
O  -5.092845 1.519796 1.334349
O  -5.44976 -0.631424 0.424689
N  1.34475 -0.947859 -0.197251
N  -2.80772 -1.796764 -0.204156
N  0.496779 -3.415504 -1.114649
N  -3.282651 0.354091 0.699063
N  -2.39825 -3.908597 -1.094208
C  2.004947 0.183819 0.470452
C  3.462634 -0.213005 0.76356
C  1.891578 1.51226 -0.299926
C  -0.020707 -1.182307 -0.186137
C  4.515043 0.098709 -0.13142
C  1.516552 1.555978 -1.662423
C  3.754627 -0.956801 1.935277
C  2.180721 2.726989 0.372228
C  -0.477354 -2.453228 -0.66606
C  -0.975562 -0.233246 0.273174
C  -1.879028 -2.701695 -0.652907
C  5.835443 -0.327517 0.139539
C  1.438521 2.791479 -2.346341
C  5.073603 -1.379531 2.210915
C  2.104525 3.961981 -0.306899
C  -2.343863 -0.605197 0.237845
C  6.119383 -1.066515 1.31071
C  1.733293 3.99843 -1.672474
C  -4.669671 0.28104 0.76327
C  -6.564025 1.696958 1.437745
C  -7.142601 2.263411 0.136607
H  1.50997 0.338156 1.456303
H  1.901484 -1.757818 -0.493798
H  4.301777 0.685424 -1.031784
H  1.273744 0.618804 -2.174406
H  2.943687 -1.204543 2.631727
H  2.474985 2.703508 1.429595
H  -0.671958 0.762584 0.607429
H  6.641632 -0.078537 -0.559741
H  1.140841 2.811407 -3.400976
H  5.28638 -1.947769 3.123384
H  2.331234 4.893052 0.224981
H  7.144327 -1.390911 1.523037
H  1.66954 4.956206 -2.201106
H  0.608324 -3.554676 -2.121669
H  0.63075 -4.257975 -0.550724
H  -2.899097 1.238222 1.038781
H  -1.794329 -4.630309 -1.474453
H  -3.407974 -4.026773 -1.063342
H  -6.686897 2.395277 2.281926
H  -7.021571 0.722028 1.683567
H  -8.223056 2.466345 0.260759
H  -6.641729 3.208252 -0.1375
H  -7.020028 1.54109 -0.688058
