program: Gaussian 09
title: 000267680
version: EM64L-G09RevD.01
frameworkgroup: C1[X(C7H10N4)]
method: RPBEPBE
basis: SDD
operation: Freq
keyword: #pfreq=noraman
keyword: PBEPBE/SDD
title: #p freq=noraman PBEPBE/SDD
converged: YES YES NO NO
title: Mulliken charges:
elementType: N N N N C C C C C C C H H H H H H H H H H
charge: -0.297466 -0.039314 -0.067696 -0.629335 -0.167328 0.050240 -0.529142 0.098031 -0.716996 0.132781 -0.383568 0.242709 0.216120 0.234978 0.267672 0.231856 0.252058 0.205402 0.242908 0.321985 0.334106
chargesum: 0.00000
title: Mulliken charges with hydrogens summed into heavy atoms:
elementType: N N N N C C C C C C C
charge: -0.029795 -0.039314 -0.067696 0.026756 0.075381 0.050240 -0.078043 0.098031 -0.027681 0.132781 -0.140660
polarizability: 1.23998589e+02 7.05251149e+00 1.12818001e+02 -2.85012476e+00 -2.00431340e+00 5.88244682e+01
1716.lowfreq: -0.0008 -0.0007 -0.0006 8.0489 10.4998 12.4867 69.6140 121.1223 158.4303
frequency: 69.5834 121.0904 158.4291 190.6882 229.9744 246.5261 296.2231 397.5169 408.0178 483.3958 494.9660 508.9296 536.4258 560.1658 608.1477 653.0317 661.8898 736.5288 780.3866 829.8702 872.6583 937.1830 941.7222 983.5583 990.3653 1027.9714 1069.2283 1098.8361 1126.2905 1155.8439 1206.9148 1231.9018 1264.4362 1282.9788 1301.6465 1313.9822 1328.7072 1383.9953 1402.4705 1426.5938 1438.4110 1469.5639 1472.7028 1476.8967 1538.9018 1574.0077 1621.4549 2952.5307 2958.0611 2983.1839 3012.2897 3078.5406 3102.5406 3157.5166 3429.1312 3545.8316 3702.6349
redmass: 3.0576 2.6066 3.0269 1.2601 2.6627 3.5729 2.9929 1.9649 1.3608 3.4161 7.4174 3.4429 1.1935 3.4101 7.0145 1.7947 5.1316 4.2868 5.2489 6.3982 1.6270 2.5692 1.5639 2.3251 1.8522 3.7613 1.9979 1.5887 3.4508 2.5901 1.3290 2.0136 2.2189 2.2906 1.6669 2.2504 2.1082 1.2341 1.9362 1.3752 2.4504 1.0502 1.1057 1.0617 7.3980 3.1900 1.6182 1.0644 1.0828 1.0368 1.0986 1.0988 1.0997 1.0920 1.0754 1.0452 1.1042
irintensity: 7.9676 4.6105 0.0457 2.8127 1.9146 2.8672 0.3091 32.3022 182.6377 0.8424 1.4411 9.1137 86.2977 4.7355 11.0580 118.7084 15.5264 7.5538 10.0447 8.3455 5.7317 13.3034 9.0149 6.4088 3.7464 19.8707 2.6049 4.9848 6.3485 0.4961 1.3922 9.4036 29.8347 7.2237 7.5091 7.5181 0.7751 24.0399 6.4955 1.0004 61.3410 15.5653 0.9585 5.0297 68.0622 147.5964 447.5281 55.6887 25.6609 29.9536 28.3079 39.2427 13.4509 22.7903 0.3025 83.7062 34.0146
temp: 298.150 k
press: 1.00000 atm
elementType: 7 7 7 7 6 6 6 6 6 6 6 1 1 1 1 1 1 1 1 1 1
symmnumber: 1
zpe: 447602.4 jmol-1
zpe.correction: 0.170483 hartree
zpe.thermalcorrener: 0.180291 hartree
zpe.thermalcorrenthalpy: 0.181235 hartree
zpe.thermalcorrgfe: 0.135592 hartree
zpe.sumelectzpe: -490.930141 hartree
zpe.sumelectthermal: -490.920333 hartree
zpe.sumelectthermalent: -490.919389 hartree
zpe.sumelectthermalfe: -490.965032 hartree
dipole: -1.1331 -3.4534 1.1470
dipole: 3.8112
quadrupole: -61.6602 -63.8304 -65.6091
quadrupole: 8.7871 2.3054 -2.3476
quadrupole: 2.0397 -0.1305 -1.9092 8.7871 2.3054 -2.3476
hfenergy: -491.100624 hartree
pointgroup: C01 [X(C7H10N4)]
dipole: -0.3423327 -1.3830716 0.4672073 debye
dipolederiv: -0.6480956 0.1250369 -0.0542231 0.1214421 -0.5481484 0.0265008 0.1964675 -0.1265295 -0.1572311 -0.7651621 0.2123346 0.0393278 0.1131605 -0.6635983 0.0181012 0.0470218 0.0081862 -0.2063384 -0.5634375 0.0222955 0.0246986 -0.3585078 -0.8037815 0.0620684 0.0536367 0.0119429 -0.2355037 -0.8142469 -0.6089107 0.0162657 -0.7465342 -0.8049119 0.0760988 0.0379435 0.0737725 -0.7173519 0.1351944 0.0424897 -0.0228804 -0.0446326 0.3962944 -0.0860507 -0.0402799 -0.0983468 0.2656164 0.5310879 -0.0148692 -0.0503899 0.0685541 0.4306445 -0.0437252 -0.138045 -0.0168481 -0.0113495 0.393283 0.0226081 0.0582997 0.0110737 0.2172661 0.0452752 0.0454183 0.0620437 0.3026425 -0.7534788 -0.4793724 0.0706327 -0.1855698 -0.214716 0.0300654 0.0598171 0.0668948 -0.0701678 0.0279138 -0.050224 -0.0544079 0.007386 -0.0721456 -0.0348386 -0.0152465 -0.0298516 0.0687259 1.0972069 0.7796073 -0.1044442 0.8071064 1.007842 -0.1020796 -0.0958416 -0.0975783 0.2210038 0.6704402 -0.0857489 -0.0771352 0.085509 0.5762864 -0.0394937 -0.0786217 -0.0231035 -0.0356377 -0.0091242 -0.0141495 0.0354046 0.0238998 -0.0041049 0.0214201 0.0337569 0.0633689 -0.1450288 0.0060274 -0.0454714 0.0307086 -0.0155692 -0.0569795 0.0877572 0.0111931 0.1536985 -0.0317544 -0.0230278 -0.0108378 -0.0396164 -0.0025474 -0.0365438 -0.0943785 -0.0600822 -0.1440446 -0.0889073 0.2282055 -0.0882218 0.015566 -0.1076987 0.1961647 -0.0443947 -0.1056785 0.0627203 -0.0342823 -0.1826685 0.0307015 0.0139152 0.0825626 0.0876504 -0.0153406 0.0185542 -0.0268254 0.0775022 0.1372351 0.0292643 -0.0124428 -0.0238186 -0.0828553 0.0323093 -0.0054285 0.0513376 0.0849266 0.0697506 -0.0254464 0.0747666 -0.0181997 0.0758996 0.0603969 0.0038853 0.0070765 -0.1489818 0.0451358 0.0762109 0.0023794 0.0733048 -0.0752909 0.0016458 0.0045844 0.0015686 0.1181087 0.1740554 0.0495581 0.0211581 0.0809136 0.1960368 -0.0029393 0.0194309 -0.00194 0.3708731 0.2437052 0.0331454 0.0124168 0.0281654 0.1789913 0.001602 0.0075142 0.0024573 0.3731357 unknown
polarizability: 122.8769441|7.8084924|113.9021419|-2.4386068|-2.8822242|58.8619718 unknown
InChI: InChI=1S/C7H10N4/c1-4-6-5(2-9-4)7(8)11-3-10-6/h3-4,9H,2,8H2,1H3
charge 0 multiplicity 1
21 atoms
N  2.008457 -1.366494 0.034495
N  0.015244 1.759319 -0.172431
N  -2.211979 0.788146 0.130615
N  -2.583239 -1.524336 0.245315
C  1.97841 0.098003 -0.319288
C  0.507455 0.48407 -0.15539
C  0.607845 -1.908972 -0.067609
C  -0.279475 -0.672913 -0.008223
C  2.950198 0.936206 0.52637
C  -1.682425 -0.487845 0.119695
C  -1.344717 1.825314 -0.014185
H  2.249802 0.217155 -1.389168
H  0.414463 -2.636548 0.744767
H  0.472954 -2.446707 -1.02897
H  2.368116 -1.481319 0.993407
H  3.993705 0.621319 0.348748
H  2.847812 2.001728 0.260296
H  2.72504 0.834747 1.605167
H  -1.787741 2.826265 -0.004637
H  -2.289393 -2.496529 0.233129
H  -3.570233 -1.289807 0.334995
